{"text_format":"1","workbook":"xlsx","n_sheets":21,"sheets":["11-państw.fund.cel.","20-państw.szk.wyż.","31-instytucje gosp budż","41-państw.inst.kult.","42-samorz.inst.kult.","50-PAN i jedn.tworz.przez PAN","61-samodz.publ.ZOZ państw.","62-samodz.publ.ZOZ samorz.","63-Narodowy Fundusz Zdrowia","71-ZUS","72-fund.zarz.przez ZUS","73-KRUS","81-państw.osoba prawna","82-samorz.osoba prawna","90-agencja wykonawcza","99-zbiorczo","RBUZA","RBUZB1","RBUZB2","RBUZB3","RBUZB4"],"not_rendered":{"charts":0,"images":0,"macros":1,"external_links":0,"defined_names":31,"comments":16,"pivot_tables":0},"unopened":[],"bounds":{"document_bytes":16777216,"sheet_cells":100000,"rows_first":2000,"rows_last":500,"rows_between":2000,"halvings":0,"cell_chars":16384,"cell_head_chars":4096},"cells_cut":0,"cells_raw":0,"read":"whole","date_system":"1900"}

{"sheet":"11-państw.fund.cel.","index":0,"n_rows":75,"n_cols":21,"rows_kept":75,"cut":false,"hidden":false,"merged":[[43,0,43,2],[57,0,57,2],[3,13,6,16],[21,0,21,1],[22,0,22,1],[53,0,53,2],[19,0,19,1],[20,0,20,1],[29,3,29,6],[15,6,16,6],[36,0,36,2],[37,0,37,2],[38,0,38,2],[31,0,31,2],[40,0,40,2],[30,0,30,2],[33,0,33,2],[34,0,34,2],[2,0,2,1],[5,0,5,1],[7,0,7,1],[8,2,8,4],[29,0,29,2],[9,2,9,4],[10,2,10,4],[44,0,44,2],[49,0,49,2],[50,0,50,2],[51,0,51,2],[52,0,52,2],[45,0,45,1],[49,3,49,6],[64,0,64,2],[29,9,29,11],[33,9,33,11],[34,9,34,11],[35,9,35,11],[36,9,36,11],[37,9,37,11],[38,9,38,11],[61,0,61,2],[57,9,57,11],[49,9,49,11],[62,9,62,11],[58,9,58,11],[59,9,59,11],[60,9,60,11],[50,9,50,11],[15,8,16,8],[63,9,63,11],[49,12,49,15],[39,9,39,11],[40,9,40,11],[55,9,55,11],[42,9,42,11],[29,12,29,15],[30,9,30,11],[31,9,31,11],[32,9,32,11],[44,9,44,11],[64,9,64,11],[63,0,63,2],[51,9,51,11],[52,9,52,11],[53,9,53,11],[54,9,54,11],[61,9,61,11],[56,9,56,11],[62,0,62,2],[55,0,55,2],[56,0,56,2],[60,0,60,2],[58,0,58,2],[59,0,59,2],[54,0,54,2],[15,7,16,7],[43,9,43,11],[17,0,17,1],[18,0,18,1],[14,0,16,1],[14,2,14,8],[15,2,16,2],[15,3,16,3],[15,4,16,4],[15,5,16,5],[41,9,41,11],[41,0,41,2],[42,0,42,2],[35,0,35,2],[32,0,32,2],[39,0,39,2]]}
[null,null,null,null,null,null,null,null,null,null,null,null,null,null,null,null,null,null,null,null,0]
["Nazwa jednostki sprawozdawczej ",null,null,null,null,"Rb-UZ  ROCZNE SPRAWOZDANIE UZUPEŁNIAJĄCE O STANIE ZOBOWIĄZAŃ ",null,null,null,null,null,null,null,null,null,null,null,null,null,null,{"$f":"MAXA('20-państw.szk.wyż.:90-agencja wykonawcza'!U1)","v":0}]
[null,null,null,null,null,null,"WG TYTUŁÓW DŁUŻNYCH ",null,null,null,null,null,null,"Adresat:"]
[null,null,null,null,null,"państwowego funduszu celowego posiadającego osobowość prawną"]
["Adres jednostki sprawozdawczej"]
[]
["Numer identyfikacyjny REGON",null,"liczba identyfik.jedn.",null,null,null,null,null,null,null,null,null,null,null,null,null,null,null,null,null,false]
[null,null,"",null,null,"wg stanu na koniec",null,4,"kwartału","  roku"]
["Nazwa województwa",null,null,null,null,null,null,"SYMBOLE"]
["Nazwa powiatu / związku",null,null,null,null,"WOJ.","POWIAT","GMINA","TYP GM.","ZWIĄZEK JST","TYP ZW.","GRUPA","CZĘŚĆ BUDŻ."]
["Nazwa gminy / związku",null,null,null,null,null,null,null,null,null,null,11]
[]
["A. Struktura walutowa tytułów dłużnych według wartości nominalnej "]
[]
["Wyszczególnienie",null,"W a l u t a"]
[null,null,"Ogółem (kol. 3+4+5+6+7)","PLN","EUR","USD","CHF","Pozostałe waluty wg średniego kursu NBP","Pozostałe waluty wg średniej arytmetycznej"]
[null,null,"Ogółem (kol. 3+4+5+6+7)",null,null,null,null,null,"Pozostałe waluty wg średniej arytmetycznej"]
[1,null,2,3,4,5,6,7,8]
["A. Zobowiązania ogółem (A1+A2+A3+A4)",null,{"$f":"D19+E19+F19+G19+H19","v":0},{"$f":"SUM(D20:D23)","v":0},0,0,0,0,0]
["A1. papiery wartościowe",null,{"$f":"D20+E20+F20+G20+H20","v":0}]
["A2. kredyty i pożyczki",null,{"$f":"D21+E21+F21+G21+H21","v":0}]
["A3. przyjęte depozyty",null,{"$f":"D22+E22+F22+G22+H22","v":0}]
["A4. wymagalne zobowiązania",null,{"$f":"D23+E23+F23+G23+H23","v":0}]
[]
[" B. Struktura terminowa zobowiązań z tytułu zaciagniętych kredytów i pożyczek oraz wyemitowanych papierów wartościowych"]
[]
[" B1. papiery wartościowe wg pierwotnego terminu zapadalności - stan na koniec okresu sprawozdawczego",null,null,null,null,null,null,null,null," B2. papiery wartościowe wg pozostałego terminu zapadalności - stan na koniec okresu sprawozdawczego"]
["      (wg wartości nominalnej)",null,null,null,null,null,null,null,null,"      (wg wartości nominalnej)"]
[]
["papiery wartościowe",null,null,"zapadalność w latach",null,null,null,null,null,"papiery wartościowe",null,null,"zapadalność w latach"]
["wierzyciele",null,null,"łącznie       (kol. 3+4+5)","( 0;1>","( 1;5>","pow. 5",null,null,"wierzyciele",null,null,"łącznie         (kol. 3+4+5)","( 0;1>","( 1;5>","pow. 5"]
[1,null,null,2,3,4,5,null,null,1,null,null,2,3,4,5]
["1. łącznie (w. 2+3+4+5+6+7+8+9+10+11+12+13)",null,null,{"$f":"SUM(D34:D45)","v":0},{"$f":"SUM(E34:E45)","v":0},{"$f":"SUM(F34:F45)","v":0},{"$f":"SUM(G34:G45)","v":0},null,null,"1. łącznie (w. 2+3+4+5+6+7+8+9+10+11+12+13)",null,null,{"$f":"SUM(M34:M45)","v":0},{"$f":"SUM(N34:N45)","v":0},{"$f":"SUM(O34:O45)","v":0},{"$f":"SUM(P34:P45)","v":0}]
["2. grupa I",null,null,{"$f":"E34+F34+G34","v":0},null,null,null,null,null,"2. grupa I",null,null,{"$f":"N34+O34+P34","v":0}]
["3. grupa II",null,null,{"$f":"E35+F35+G35","v":0},null,null,null,null,null,"3. grupa II",null,null,{"$f":"N35+O35+P35","v":0}]
["4. grupa III",null,null,0,null,null,null,null,null,"4. grupa III",null,null,0]
["5.grupa IV",null,null,0,null,null,null,null,null,"5.grupa IV",null,null,0]
["6. bank centralny",null,null,0,null,null,null,null,null,"6. bank centralny",null,null,0]
["7. banki",null,null,0,null,null,null,null,null,"7. banki",null,null,0]
["8. pozostałe krajowe instytucje finansowe",null,null,0,null,null,null,null,null,"8. pozostałe krajowe instytucje finansowe",null,null,0]
["9. przedsiębiorstwa niefinansowe",null,null,0,null,null,null,null,null,"9. przedsiębiorstwa niefinansowe",null,null,0]
["10. gospodarstwa domowe",null,null,0,null,null,null,null,null,"10. gospodarstwa domowe",null,null,0]
["11. instytucje niekomercyjne działające na rzecz gospodarstw domowych",null,null,0,null,null,null,null,null,"11. instytucje niekomercyjne działające na rzecz gospodarstw domowych",null,null,0]
["12. podmioty nalezące do strefy euro",null,null,0,null,null,null,null,null,"12. podmioty nalezące do strefy euro",null,null,0]
["13. pozostałe podmioty zagraniczne",null,null,0,null,null,null,null,null,"13. pozostałe podmioty zagraniczne",null,null,0]
[]
[" B3. kredyty i pożyczki wg pierwotnego terminu zapadalności - stan na koniec okresu sprawozdawczego",null,null,null,null,null,null,null,null," B4. kredyty i pożyczki wg pozostałego terminu zapadalności - stan na koniec okresu sprawozdawczego"]
["      (wg wartości nominalnej)",null,null,null,null,null,null,null,null,"      (wg wartości nominalnej)"]
[]
["kredyty i pożyczki",null,null,"zapadalność w latach",null,null,null,null,null,"kredyty i pożyczki",null,null,"zapadalność w latach"]
["wierzyciele",null,null,"łącznie       (kol. 3+4+5)","( 0;1>","( 1;5>","pow. 5",null,null,"wierzyciele",null,null,"łącznie         (kol. 3+4+5)","( 0;1>","( 1;5>","pow. 5"]
[1,null,null,2,3,4,5,null,null,1,null,null,2,3,4,5]
["1. łącznie (w. 2+3+4+5+6+7+8+9+10+11+12+13)",null,null,{"$f":"SUM(D54:D65)","v":0},{"$f":"SUM(E54:E65)","v":0},{"$f":"SUM(F54:F65)","v":0},{"$f":"SUM(G54:G65)","v":0},null,null,"1. łącznie (w. 2+3+4+5+6+7+8+9+10+11+12+13)",null,null,{"$f":"SUM(M54:M65)","v":0},{"$f":"SUM(N54:N65)","v":0},{"$f":"SUM(O54:O65)","v":0},{"$f":"SUM(P54:P65)","v":0}]
["2. grupa I",null,null,{"$f":"E54+F54+G54","v":0},null,null,null,null,null,"2. grupa I",null,null,{"$f":"N54+O54+P54","v":0}]
["3. grupa II",null,null,{"$f":"E55+F55+G55","v":0},null,null,null,null,null,"3. grupa II",null,null,{"$f":"N55+O55+P55","v":0}]
["4. grupa III",null,null,0,null,null,null,null,null,"4. grupa III",null,null,0]
["5.grupa IV",null,null,0,null,null,null,null,null,"5.grupa IV",null,null,0]
["6. bank centralny",null,null,0,null,null,null,null,null,"6. bank centralny",null,null,0]
["7. banki",null,null,0,null,null,null,null,null,"7. banki",null,null,0]
["8. pozostałe krajowe instytucje finansowe",null,null,0,null,null,null,null,null,"8. pozostałe krajowe instytucje finansowe",null,null,0]
["9. przedsiębiorstwa niefinansowe",null,null,0,null,null,null,null,null,"9. przedsiębiorstwa niefinansowe",null,null,0]
["10. gospodarstwa domowe",null,null,0,null,null,null,null,null,"10. gospodarstwa domowe",null,null,0]
["11. instytucje niekomercyjne działające na rzecz gospodarstw domowych",null,null,0,null,null,null,null,null,"11. instytucje niekomercyjne działające na rzecz gospodarstw domowych",null,null,0]
["12. podmioty nalezące do strefy euro",null,null,0,null,null,null,null,null,"12. podmioty nalezące do strefy euro",null,null,0]
["13. pozostałe podmioty zagraniczne",null,null,0,null,null,null,null,null,"13. pozostałe podmioty zagraniczne",null,null,0]
[]
[]
[]
[]
[]
[]
[]
[". . . . . . . . . . . . . . . . . . . . . . . . . . . . .  .  .",null,null,null,". . . . . . . . . . .",null,null,". . . . . . . . . . .",null,null,". . . . . . . . . . . . . . . . ."]
["Główny księgowy* / Skarbnik",null,null,null,"telefon",null,null,"rok m-c dzień",null,null,"Kierownik jednostki (jednostki obsługującej)/ Przewodniczący Zarządu"]
["* Nie dotyczy sprawozdań zbiorczych sporządzanych przez RIO. W przypadku braku głównego księgowego podpisuje tylko kierownik jednostki."]

{"sheet":"20-państw.szk.wyż.","index":1,"n_rows":75,"n_cols":21,"rows_kept":75,"cut":false,"hidden":false,"merged":[[3,13,6,16],[8,2,8,4],[34,0,34,2],[22,0,22,1],[19,0,19,1],[20,0,20,1],[21,0,21,1],[29,9,29,11],[32,9,32,11],[33,9,33,11],[34,9,34,11],[29,12,29,15],[30,9,30,11],[31,9,31,11],[17,0,17,1],[18,0,18,1],[33,0,33,2],[32,0,32,2],[36,0,36,2],[35,0,35,2],[2,0,2,1],[5,0,5,1],[7,0,7,1],[9,2,9,4],[10,2,10,4],[61,0,61,2],[54,0,54,2],[55,0,55,2],[56,0,56,2],[55,9,55,11],[56,9,56,11],[54,9,54,11],[59,0,59,2],[58,0,58,2],[61,9,61,11],[52,0,52,2],[57,0,57,2],[52,9,52,11],[60,0,60,2],[53,9,53,11],[53,0,53,2],[57,9,57,11],[58,9,58,11],[59,9,59,11],[60,9,60,11],[49,12,49,15],[50,9,50,11],[35,9,35,11],[41,9,41,11],[42,9,42,11],[40,9,40,11],[36,9,36,11],[37,9,37,11],[38,9,38,11],[39,9,39,11],[43,9,43,11],[44,9,44,11],[49,9,49,11],[64,0,64,2],[62,9,62,11],[63,9,63,11],[64,9,64,11],[63,0,63,2],[62,0,62,2],[51,9,51,11],[45,0,45,1],[50,0,50,2],[49,0,49,2],[49,3,49,6],[51,0,51,2],[40,0,40,2],[41,0,41,2],[42,0,42,2],[43,0,43,2],[44,0,44,2],[39,0,39,2],[29,3,29,6],[15,5,16,5],[15,6,16,6],[14,0,16,1],[14,2,14,8],[15,2,16,2],[15,3,16,3],[15,4,16,4],[15,7,16,7],[15,8,16,8],[37,0,37,2],[38,0,38,2],[31,0,31,2],[29,0,29,2],[30,0,30,2]]}
[]
["Nazwa jednostki sprawozdawczej ",null,null,null,null,"Rb-UZ  ROCZNE SPRAWOZDANIE UZUPEŁNIAJĄCE O STANIE ZOBOWIĄZAŃ ",null,null,null,null,null,null,null,null,null,null,null,null,null,null,{"$f":"MAXA('20-państw.szk.wyż.:90-agencja wykonawcza'!U1)","v":0}]
[null,null,null,null,null,null,"WG TYTUŁÓW DŁUŻNYCH ",null,null,null,null,null,null,"Adresat:"]
[null,null,null,null,null,null,"uczelni publicznej"]
["Adres jednostki sprawozdawczej"]
[]
["Numer identyfikacyjny REGON",null,"liczba identyfik.jedn."]
[null,null,"",null,null,"wg stanu na koniec",null,4,"kwartału","  roku"]
["Nazwa województwa",null,null,null,null,null,null,"SYMBOLE"]
["Nazwa powiatu / związku",null,null,null,null,"WOJ.","POWIAT","GMINA","TYP GM.","ZWIĄZEK JST","TYP ZW.","GRUPA","CZĘŚĆ BUDŻ."]
["Nazwa gminy / związku",null,null,null,null,null,null,null,null,null,null,20]
[]
["A. Struktura walutowa tytułów dłużnych według wartości nominalnej "]
[]
["Wyszczególnienie",null,"W a l u t a"]
[null,null,"Ogółem (kol. 3+4+5+6+7)","PLN","EUR","USD","CHF","Pozostałe waluty wg średniego kursu NBP","Pozostałe waluty wg średniej arytmetycznej"]
[null,null,"Ogółem (kol. 3+4+5+6+7)",null,null,null,null,null,"Pozostałe waluty wg średniej arytmetycznej"]
[1,null,2,3,4,5,6,7,8]
["A. Zobowiązania ogółem (A1+A2+A3+A4)",null,{"$f":"D19+E19+F19+G19+H19","v":0},{"$f":"SUM(D20:D23)","v":0},0,0,0,0,0]
["A1. papiery wartościowe",null,{"$f":"D20+E20+F20+G20+H20","v":0}]
["A2. kredyty i pożyczki",null,{"$f":"D21+E21+F21+G21+H21","v":0}]
["A3. przyjęte depozyty",null,{"$f":"D22+E22+F22+G22+H22","v":0}]
["A4. wymagalne zobowiązania",null,{"$f":"D23+E23+F23+G23+H23","v":0}]
[]
[" B. Struktura terminowa zobowiązań z tytułu zaciagniętych kredytów i pożyczek oraz wyemitowanych papierów wartościowych"]
[]
[" B1. papiery wartościowe wg pierwotnego terminu zapadalności - stan na koniec okresu sprawozdawczego",null,null,null,null,null,null,null,null," B2. papiery wartościowe wg pozostałego terminu zapadalności - stan na koniec okresu sprawozdawczego"]
["      (wg wartości nominalnej)",null,null,null,null,null,null,null,null,"      (wg wartości nominalnej)"]
[]
["papiery wartościowe",null,null,"zapadalność w latach",null,null,null,null,null,"papiery wartościowe",null,null,"zapadalność w latach"]
["wierzyciele",null,null,"łącznie       (kol. 3+4+5)","( 0;1>","( 1;5>","pow. 5",null,null,"wierzyciele",null,null,"łącznie         (kol. 3+4+5)","( 0;1>","( 1;5>","pow. 5"]
[1,null,null,2,3,4,5,null,null,1,null,null,2,3,4,5]
["1. łącznie (w. 2+3+4+5+6+7+8+9+10+11+12+13)",null,null,{"$f":"SUM(D34:D45)","v":0},{"$f":"SUM(E34:E45)","v":0},{"$f":"SUM(F34:F45)","v":0},{"$f":"SUM(G34:G45)","v":0},null,null,"1. łącznie (w. 2+3+4+5+6+7+8+9+10+11+12+13)",null,null,{"$f":"SUM(M34:M45)","v":0},{"$f":"SUM(N34:N45)","v":0},{"$f":"SUM(O34:O45)","v":0},{"$f":"SUM(P34:P45)","v":0}]
["2. grupa I",null,null,{"$f":"E34+F34+G34","v":0},null,null,null,null,null,"2. grupa I",null,null,{"$f":"N34+O34+P34","v":0}]
["3. grupa II",null,null,{"$f":"E35+F35+G35","v":0},null,null,null,null,null,"3. grupa II",null,null,{"$f":"N35+O35+P35","v":0}]
["4. grupa III",null,null,0,null,null,null,null,null,"4. grupa III",null,null,0]
["5.grupa IV",null,null,0,null,null,null,null,null,"5.grupa IV",null,null,0]
["6. bank centralny",null,null,0,null,null,null,null,null,"6. bank centralny",null,null,0]
["7. banki",null,null,0,null,null,null,null,null,"7. banki",null,null,0]
["8. pozostałe krajowe instytucje finansowe",null,null,0,null,null,null,null,null,"8. pozostałe krajowe instytucje finansowe",null,null,0]
["9. przedsiębiorstwa niefinansowe",null,null,0,null,null,null,null,null,"9. przedsiębiorstwa niefinansowe",null,null,0]
["10. gospodarstwa domowe",null,null,0,null,null,null,null,null,"10. gospodarstwa domowe",null,null,0]
["11. instytucje niekomercyjne działające na rzecz gospodarstw domowych",null,null,0,null,null,null,null,null,"11. instytucje niekomercyjne działające na rzecz gospodarstw domowych",null,null,0]
["12. podmioty nalezące do strefy euro",null,null,0,null,null,null,null,null,"12. podmioty nalezące do strefy euro",null,null,0]
["13. pozostałe podmioty zagraniczne",null,null,0,null,null,null,null,null,"13. pozostałe podmioty zagraniczne",null,null,0]
[]
[" B3. kredyty i pożyczki wg pierwotnego terminu zapadalności - stan na koniec okresu sprawozdawczego",null,null,null,null,null,null,null,null," B4. kredyty i pożyczki wg pozostałego terminu zapadalności - stan na koniec okresu sprawozdawczego"]
["      (wg wartości nominalnej)",null,null,null,null,null,null,null,null,"      (wg wartości nominalnej)"]
[]
["kredyty i pożyczki",null,null,"zapadalność w latach",null,null,null,null,null,"kredyty i pożyczki",null,null,"zapadalność w latach"]
["wierzyciele",null,null,"łącznie       (kol. 3+4+5)","( 0;1>","( 1;5>","pow. 5",null,null,"wierzyciele",null,null,"łącznie         (kol. 3+4+5)","( 0;1>","( 1;5>","pow. 5"]
[1,null,null,2,3,4,5,null,null,1,null,null,2,3,4,5]
["1. łącznie (w. 2+3+4+5+6+7+8+9+10+11+12+13)",null,null,{"$f":"SUM(D54:D65)","v":0},{"$f":"SUM(E54:E65)","v":0},{"$f":"SUM(F54:F65)","v":0},{"$f":"SUM(G54:G65)","v":0},null,null,"1. łącznie (w. 2+3+4+5+6+7+8+9+10+11+12+13)",null,null,{"$f":"SUM(M54:M65)","v":0},{"$f":"SUM(N54:N65)","v":0},{"$f":"SUM(O54:O65)","v":0},{"$f":"SUM(P54:P65)","v":0}]
["2. grupa I",null,null,{"$f":"E54+F54+G54","v":0},null,null,null,null,null,"2. grupa I",null,null,{"$f":"N54+O54+P54","v":0}]
["3. grupa II",null,null,{"$f":"E55+F55+G55","v":0},null,null,null,null,null,"3. grupa II",null,null,{"$f":"N55+O55+P55","v":0}]
["4. grupa III",null,null,0,null,null,null,null,null,"4. grupa III",null,null,0]
["5.grupa IV",null,null,0,null,null,null,null,null,"5.grupa IV",null,null,0]
["6. bank centralny",null,null,0,null,null,null,null,null,"6. bank centralny",null,null,0]
["7. banki",null,null,0,null,null,null,null,null,"7. banki",null,null,0]
["8. pozostałe krajowe instytucje finansowe",null,null,0,null,null,null,null,null,"8. pozostałe krajowe instytucje finansowe",null,null,0]
["9. przedsiębiorstwa niefinansowe",null,null,0,null,null,null,null,null,"9. przedsiębiorstwa niefinansowe",null,null,0]
["10. gospodarstwa domowe",null,null,0,null,null,null,null,null,"10. gospodarstwa domowe",null,null,0]
["11. instytucje niekomercyjne działające na rzecz gospodarstw domowych",null,null,0,null,null,null,null,null,"11. instytucje niekomercyjne działające na rzecz gospodarstw domowych",null,null,0]
["12. podmioty nalezące do strefy euro",null,null,0,null,null,null,null,null,"12. podmioty nalezące do strefy euro",null,null,0]
["13. pozostałe podmioty zagraniczne",null,null,0,null,null,null,null,null,"13. pozostałe podmioty zagraniczne",null,null,0]
[]
[]
[]
[]
[]
[]
[]
[". . . . . . . . . . . . . . . . . . . . . . . . . . . . .  .  .",null,null,null,". . . . . . . . . . .",null,null,". . . . . . . . . . .",null,null,". . . . . . . . . . . . . . . . ."]
["Główny księgowy / Skarbnik",null,null,null,"telefon",null,null,"rok m-c dzień",null,null,"Kierownik jednostki (jednostki obsługującej)/ Przewodniczący Zarządu"]
["* Nie dotyczy sprawozdań zbiorczych sporządzanych przez RIO. W przypadku braku głównego księgowego podpisuje tylko kierownik jednostki."]

{"sheet":"31-instytucje gosp budż","index":2,"n_rows":75,"n_cols":21,"rows_kept":75,"cut":false,"hidden":false,"merged":[[3,13,6,16],[8,2,8,4],[34,0,34,2],[22,0,22,1],[19,0,19,1],[20,0,20,1],[21,0,21,1],[29,9,29,11],[32,9,32,11],[33,9,33,11],[34,9,34,11],[29,12,29,15],[30,9,30,11],[31,9,31,11],[17,0,17,1],[18,0,18,1],[33,0,33,2],[32,0,32,2],[36,0,36,2],[35,0,35,2],[2,0,2,1],[5,0,5,1],[7,0,7,1],[9,2,9,4],[10,2,10,4],[61,0,61,2],[54,0,54,2],[55,0,55,2],[56,0,56,2],[55,9,55,11],[56,9,56,11],[54,9,54,11],[59,0,59,2],[58,0,58,2],[61,9,61,11],[52,0,52,2],[57,0,57,2],[52,9,52,11],[60,0,60,2],[53,9,53,11],[53,0,53,2],[57,9,57,11],[58,9,58,11],[59,9,59,11],[60,9,60,11],[49,12,49,15],[50,9,50,11],[35,9,35,11],[41,9,41,11],[42,9,42,11],[40,9,40,11],[36,9,36,11],[37,9,37,11],[38,9,38,11],[39,9,39,11],[43,9,43,11],[44,9,44,11],[49,9,49,11],[64,0,64,2],[62,9,62,11],[63,9,63,11],[64,9,64,11],[63,0,63,2],[62,0,62,2],[51,9,51,11],[45,0,45,1],[50,0,50,2],[49,0,49,2],[49,3,49,6],[51,0,51,2],[40,0,40,2],[41,0,41,2],[42,0,42,2],[43,0,43,2],[44,0,44,2],[39,0,39,2],[29,3,29,6],[15,5,16,5],[15,6,16,6],[14,0,16,1],[14,2,14,8],[15,2,16,2],[15,3,16,3],[15,4,16,4],[15,7,16,7],[15,8,16,8],[37,0,37,2],[38,0,38,2],[31,0,31,2],[29,0,29,2],[30,0,30,2]]}
[]
["Nazwa jednostki sprawozdawczej ",null,null,null,null,"Rb-UZ  ROCZNE SPRAWOZDANIE UZUPEŁNIAJĄCE O STANIE ZOBOWIĄZAŃ ",null,null,null,null,null,null,null,null,null,null,null,null,null,null,{"$f":"MAXA('20-państw.szk.wyż.:90-agencja wykonawcza'!U1)","v":0}]
[null,null,null,null,null,null,"WG TYTUŁÓW DŁUŻNYCH ",null,null,null,null,null,null,"Adresat:"]
[null,null,null,null,null,null,"instytucji gospodarki budżetowej"]
["Adres jednostki sprawozdawczej"]
[]
["Numer identyfikacyjny REGON",null,"liczba identyfik.jedn."]
[null,null,"",null,null,"wg stanu na koniec",null,4,"kwartału","  roku"]
["Nazwa województwa",null,null,null,null,null,null,"SYMBOLE"]
["Nazwa powiatu / związku",null,null,null,null,"WOJ.","POWIAT","GMINA","TYP GM.","ZWIĄZEK JST","TYP ZW.","GRUPA","CZĘŚĆ BUDŻ."]
["Nazwa gminy / związku",null,null,null,null,null,null,null,null,null,null,31]
[]
["A. Struktura walutowa tytułów dłużnych według wartości nominalnej "]
[]
["Wyszczególnienie",null,"W a l u t a"]
[null,null,"Ogółem (kol. 3+4+5+6+7)","PLN","EUR","USD","CHF","Pozostałe waluty wg średniego kursu NBP","Pozostałe waluty wg średniej arytmetycznej"]
[null,null,"Ogółem (kol. 3+4+5+6+7)",null,null,null,null,null,"Pozostałe waluty wg średniej arytmetycznej"]
[1,null,2,3,4,5,6,7,8]
["A. Zobowiązania ogółem (A1+A2+A3+A4)",null,{"$f":"D19+E19+F19+G19+H19","v":0},{"$f":"SUM(D20:D23)","v":0},0,0,0,0,0]
["A1. papiery wartościowe",null,{"$f":"D20+E20+F20+G20+H20","v":0}]
["A2. kredyty i pożyczki",null,{"$f":"D21+E21+F21+G21+H21","v":0}]
["A3. przyjęte depozyty",null,{"$f":"D22+E22+F22+G22+H22","v":0}]
["A4. wymagalne zobowiązania",null,{"$f":"D23+E23+F23+G23+H23","v":0}]
[]
[" B. Struktura terminowa zobowiązań z tytułu zaciagniętych kredytów i pożyczek oraz wyemitowanych papierów wartościowych"]
[]
[" B1. papiery wartościowe wg pierwotnego terminu zapadalności - stan na koniec okresu sprawozdawczego",null,null,null,null,null,null,null,null," B2. papiery wartościowe wg pozostałego terminu zapadalności - stan na koniec okresu sprawozdawczego"]
["      (wg wartości nominalnej)",null,null,null,null,null,null,null,null,"      (wg wartości nominalnej)"]
[]
["papiery wartościowe",null,null,"zapadalność w latach",null,null,null,null,null,"papiery wartościowe",null,null,"zapadalność w latach"]
["wierzyciele",null,null,"łącznie       (kol. 3+4+5)","( 0;1>","( 1;5>","pow. 5",null,null,"wierzyciele",null,null,"łącznie         (kol. 3+4+5)","( 0;1>","( 1;5>","pow. 5"]
[1,null,null,2,3,4,5,null,null,1,null,null,2,3,4,5]
["1. łącznie (w. 2+3+4+5+6+7+8+9+10+11+12+13)",null,null,{"$f":"SUM(D34:D45)","v":0},{"$f":"SUM(E34:E45)","v":0},{"$f":"SUM(F34:F45)","v":0},{"$f":"SUM(G34:G45)","v":0},null,null,"1. łącznie (w. 2+3+4+5+6+7+8+9+10+11+12+13)",null,null,{"$f":"SUM(M34:M45)","v":0},{"$f":"SUM(N34:N45)","v":0},{"$f":"SUM(O34:O45)","v":0},{"$f":"SUM(P34:P45)","v":0}]
["2. grupa I",null,null,{"$f":"E34+F34+G34","v":0},null,null,null,null,null,"2. grupa I",null,null,{"$f":"N34+O34+P34","v":0}]
["3. grupa II",null,null,{"$f":"E35+F35+G35","v":0},null,null,null,null,null,"3. grupa II",null,null,{"$f":"N35+O35+P35","v":0}]
["4. grupa III",null,null,0,null,null,null,null,null,"4. grupa III",null,null,0]
["5.grupa IV",null,null,0,null,null,null,null,null,"5.grupa IV",null,null,0]
["6. bank centralny",null,null,0,null,null,null,null,null,"6. bank centralny",null,null,0]
["7. banki",null,null,0,null,null,null,null,null,"7. banki",null,null,0]
["8. pozostałe krajowe instytucje finansowe",null,null,0,null,null,null,null,null,"8. pozostałe krajowe instytucje finansowe",null,null,0]
["9. przedsiębiorstwa niefinansowe",null,null,0,null,null,null,null,null,"9. przedsiębiorstwa niefinansowe",null,null,0]
["10. gospodarstwa domowe",null,null,0,null,null,null,null,null,"10. gospodarstwa domowe",null,null,0]
["11. instytucje niekomercyjne działające na rzecz gospodarstw domowych",null,null,0,null,null,null,null,null,"11. instytucje niekomercyjne działające na rzecz gospodarstw domowych",null,null,0]
["12. podmioty nalezące do strefy euro",null,null,0,null,null,null,null,null,"12. podmioty nalezące do strefy euro",null,null,0]
["13. pozostałe podmioty zagraniczne",null,null,0,null,null,null,null,null,"13. pozostałe podmioty zagraniczne",null,null,0]
[]
[" B3. kredyty i pożyczki wg pierwotnego terminu zapadalności - stan na koniec okresu sprawozdawczego",null,null,null,null,null,null,null,null," B4. kredyty i pożyczki wg pozostałego terminu zapadalności - stan na koniec okresu sprawozdawczego"]
["      (wg wartości nominalnej)",null,null,null,null,null,null,null,null,"      (wg wartości nominalnej)"]
[]
["kredyty i pożyczki",null,null,"zapadalność w latach",null,null,null,null,null,"kredyty i pożyczki",null,null,"zapadalność w latach"]
["wierzyciele",null,null,"łącznie       (kol. 3+4+5)","( 0;1>","( 1;5>","pow. 5",null,null,"wierzyciele",null,null,"łącznie         (kol. 3+4+5)","( 0;1>","( 1;5>","pow. 5"]
[1,null,null,2,3,4,5,null,null,1,null,null,2,3,4,5]
["1. łącznie (w. 2+3+4+5+6+7+8+9+10+11+12+13)",null,null,{"$f":"SUM(D54:D65)","v":0},{"$f":"SUM(E54:E65)","v":0},{"$f":"SUM(F54:F65)","v":0},{"$f":"SUM(G54:G65)","v":0},null,null,"1. łącznie (w. 2+3+4+5+6+7+8+9+10+11+12+13)",null,null,{"$f":"SUM(M54:M65)","v":0},{"$f":"SUM(N54:N65)","v":0},{"$f":"SUM(O54:O65)","v":0},{"$f":"SUM(P54:P65)","v":0}]
["2. grupa I",null,null,{"$f":"E54+F54+G54","v":0},null,null,null,null,null,"2. grupa I",null,null,{"$f":"N54+O54+P54","v":0}]
["3. grupa II",null,null,{"$f":"E55+F55+G55","v":0},null,null,null,null,null,"3. grupa II",null,null,{"$f":"N55+O55+P55","v":0}]
["4. grupa III",null,null,0,null,null,null,null,null,"4. grupa III",null,null,0]
["5.grupa IV",null,null,0,null,null,null,null,null,"5.grupa IV",null,null,0]
["6. bank centralny",null,null,0,null,null,null,null,null,"6. bank centralny",null,null,0]
["7. banki",null,null,0,null,null,null,null,null,"7. banki",null,null,0]
["8. pozostałe krajowe instytucje finansowe",null,null,0,null,null,null,null,null,"8. pozostałe krajowe instytucje finansowe",null,null,0]
["9. przedsiębiorstwa niefinansowe",null,null,0,null,null,null,null,null,"9. przedsiębiorstwa niefinansowe",null,null,0]
["10. gospodarstwa domowe",null,null,0,null,null,null,null,null,"10. gospodarstwa domowe",null,null,0]
["11. instytucje niekomercyjne działające na rzecz gospodarstw domowych",null,null,0,null,null,null,null,null,"11. instytucje niekomercyjne działające na rzecz gospodarstw domowych",null,null,0]
["12. podmioty nalezące do strefy euro",null,null,0,null,null,null,null,null,"12. podmioty nalezące do strefy euro",null,null,0]
["13. pozostałe podmioty zagraniczne",null,null,0,null,null,null,null,null,"13. pozostałe podmioty zagraniczne",null,null,0]
[]
[]
[]
[]
[]
[]
[]
[". . . . . . . . . . . . . . . . . . . . . . . . . . . . .  .  .",null,null,null,". . . . . . . . . . .",null,null,". . . . . . . . . . .",null,null,". . . . . . . . . . . . . . . . ."]
["Główny księgowy / Skarbnik",null,null,null,"telefon",null,null,"rok m-c dzień",null,null,"Kierownik jednostki (jednostki obsługującej)/ Przewodniczący Zarządu"]
["* Nie dotyczy sprawozdań zbiorczych sporządzanych przez RIO. W przypadku braku głównego księgowego podpisuje tylko kierownik jednostki."]

{"sheet":"41-państw.inst.kult.","index":3,"n_rows":75,"n_cols":21,"rows_kept":75,"cut":false,"hidden":false,"merged":[[3,13,6,16],[8,2,8,4],[34,0,34,2],[22,0,22,1],[19,0,19,1],[20,0,20,1],[21,0,21,1],[29,9,29,11],[32,9,32,11],[33,9,33,11],[34,9,34,11],[29,12,29,15],[30,9,30,11],[31,9,31,11],[17,0,17,1],[18,0,18,1],[33,0,33,2],[32,0,32,2],[36,0,36,2],[35,0,35,2],[2,0,2,1],[5,0,5,1],[7,0,7,1],[9,2,9,4],[10,2,10,4],[61,0,61,2],[54,0,54,2],[55,0,55,2],[56,0,56,2],[55,9,55,11],[56,9,56,11],[54,9,54,11],[59,0,59,2],[58,0,58,2],[61,9,61,11],[52,0,52,2],[57,0,57,2],[52,9,52,11],[60,0,60,2],[53,9,53,11],[53,0,53,2],[57,9,57,11],[58,9,58,11],[59,9,59,11],[60,9,60,11],[49,12,49,15],[50,9,50,11],[35,9,35,11],[41,9,41,11],[42,9,42,11],[40,9,40,11],[36,9,36,11],[37,9,37,11],[38,9,38,11],[39,9,39,11],[43,9,43,11],[44,9,44,11],[49,9,49,11],[64,0,64,2],[62,9,62,11],[63,9,63,11],[64,9,64,11],[63,0,63,2],[62,0,62,2],[51,9,51,11],[45,0,45,1],[50,0,50,2],[49,0,49,2],[49,3,49,6],[51,0,51,2],[40,0,40,2],[41,0,41,2],[42,0,42,2],[43,0,43,2],[44,0,44,2],[39,0,39,2],[29,3,29,6],[15,5,16,5],[15,6,16,6],[14,0,16,1],[14,2,14,8],[15,2,16,2],[15,3,16,3],[15,4,16,4],[15,7,16,7],[15,8,16,8],[37,0,37,2],[38,0,38,2],[31,0,31,2],[29,0,29,2],[30,0,30,2]]}
[]
["Nazwa jednostki sprawozdawczej ",null,null,null,null,"Rb-UZ  ROCZNE SPRAWOZDANIE UZUPEŁNIAJĄCE O STANIE ZOBOWIĄZAŃ ",null,null,null,null,null,null,null,null,null,null,null,null,null,null,{"$f":"MAXA('20-państw.szk.wyż.:90-agencja wykonawcza'!U1)","v":0}]
[null,null,null,null,null,null,"WG TYTUŁÓW DŁUŻNYCH ",null,null,null,null,null,null,"Adresat:"]
[null,null,null,null,null,null,"państwowej instytucji kultury"]
["Adres jednostki sprawozdawczej"]
[]
["Numer identyfikacyjny REGON",null,"liczba identyfik.jedn."]
[null,null,"",null,null,"wg stanu na koniec",null,4,"kwartału","  roku"]
["Nazwa województwa",null,null,null,null,null,null,"SYMBOLE"]
["Nazwa powiatu / związku",null,null,null,null,"WOJ.","POWIAT","GMINA","TYP GM.","ZWIĄZEK JST","TYP ZW.","GRUPA","CZĘŚĆ BUDŻ."]
["Nazwa gminy / związku",null,null,null,null,null,null,null,null,null,null,41]
[]
["A. Struktura walutowa tytułów dłużnych według wartości nominalnej "]
[]
["Wyszczególnienie",null,"W a l u t a"]
[null,null,"Ogółem (kol. 3+4+5+6+7)","PLN","EUR","USD","CHF","Pozostałe waluty wg średniego kursu NBP","Pozostałe waluty wg średniej arytmetycznej"]
[null,null,"Ogółem (kol. 3+4+5+6+7)",null,null,null,null,null,"Pozostałe waluty wg średniej arytmetycznej"]
[1,null,2,3,4,5,6,7,8]
["A. Zobowiązania ogółem (A1+A2+A3+A4)",null,{"$f":"D19+E19+F19+G19+H19","v":0},{"$f":"SUM(D20:D23)","v":0},0,0,0,0,0]
["A1. papiery wartościowe",null,{"$f":"D20+E20+F20+G20+H20","v":0}]
["A2. kredyty i pożyczki",null,{"$f":"D21+E21+F21+G21+H21","v":0}]
["A3. przyjęte depozyty",null,{"$f":"D22+E22+F22+G22+H22","v":0}]
["A4. wymagalne zobowiązania",null,{"$f":"D23+E23+F23+G23+H23","v":0}]
[]
[" B. Struktura terminowa zobowiązań z tytułu zaciagniętych kredytów i pożyczek oraz wyemitowanych papierów wartościowych"]
[]
[" B1. papiery wartościowe wg pierwotnego terminu zapadalności - stan na koniec okresu sprawozdawczego",null,null,null,null,null,null,null,null," B2. papiery wartościowe wg pozostałego terminu zapadalności - stan na koniec okresu sprawozdawczego"]
["      (wg wartości nominalnej)",null,null,null,null,null,null,null,null,"      (wg wartości nominalnej)"]
[]
["papiery wartościowe",null,null,"zapadalność w latach",null,null,null,null,null,"papiery wartościowe",null,null,"zapadalność w latach"]
["wierzyciele",null,null,"łącznie       (kol. 3+4+5)","( 0;1>","( 1;5>","pow. 5",null,null,"wierzyciele",null,null,"łącznie         (kol. 3+4+5)","( 0;1>","( 1;5>","pow. 5"]
[1,null,null,2,3,4,5,null,null,1,null,null,2,3,4,5]
["1. łącznie (w. 2+3+4+5+6+7+8+9+10+11+12+13)",null,null,{"$f":"SUM(D34:D45)","v":0},{"$f":"SUM(E34:E45)","v":0},{"$f":"SUM(F34:F45)","v":0},{"$f":"SUM(G34:G45)","v":0},null,null,"1. łącznie (w. 2+3+4+5+6+7+8+9+10+11+12+13)",null,null,{"$f":"SUM(M34:M45)","v":0},{"$f":"SUM(N34:N45)","v":0},{"$f":"SUM(O34:O45)","v":0},{"$f":"SUM(P34:P45)","v":0}]
["2. grupa I",null,null,{"$f":"E34+F34+G34","v":0},null,null,null,null,null,"2. grupa I",null,null,{"$f":"N34+O34+P34","v":0}]
["3. grupa II",null,null,{"$f":"E35+F35+G35","v":0},null,null,null,null,null,"3. grupa II",null,null,{"$f":"N35+O35+P35","v":0}]
["4. grupa III",null,null,0,null,null,null,null,null,"4. grupa III",null,null,0]
["5.grupa IV",null,null,0,null,null,null,null,null,"5.grupa IV",null,null,0]
["6. bank centralny",null,null,0,null,null,null,null,null,"6. bank centralny",null,null,0]
["7. banki",null,null,0,null,null,null,null,null,"7. banki",null,null,0]
["8. pozostałe krajowe instytucje finansowe",null,null,0,null,null,null,null,null,"8. pozostałe krajowe instytucje finansowe",null,null,0]
["9. przedsiębiorstwa niefinansowe",null,null,0,null,null,null,null,null,"9. przedsiębiorstwa niefinansowe",null,null,0]
["10. gospodarstwa domowe",null,null,0,null,null,null,null,null,"10. gospodarstwa domowe",null,null,0]
["11. instytucje niekomercyjne działające na rzecz gospodarstw domowych",null,null,0,null,null,null,null,null,"11. instytucje niekomercyjne działające na rzecz gospodarstw domowych",null,null,0]
["12. podmioty nalezące do strefy euro",null,null,0,null,null,null,null,null,"12. podmioty nalezące do strefy euro",null,null,0]
["13. pozostałe podmioty zagraniczne",null,null,0,null,null,null,null,null,"13. pozostałe podmioty zagraniczne",null,null,0]
[]
[" B3. kredyty i pożyczki wg pierwotnego terminu zapadalności - stan na koniec okresu sprawozdawczego",null,null,null,null,null,null,null,null," B4. kredyty i pożyczki wg pozostałego terminu zapadalności - stan na koniec okresu sprawozdawczego"]
["      (wg wartości nominalnej)",null,null,null,null,null,null,null,null,"      (wg wartości nominalnej)"]
[]
["kredyty i pożyczki",null,null,"zapadalność w latach",null,null,null,null,null,"kredyty i pożyczki",null,null,"zapadalność w latach"]
["wierzyciele",null,null,"łącznie       (kol. 3+4+5)","( 0;1>","( 1;5>","pow. 5",null,null,"wierzyciele",null,null,"łącznie         (kol. 3+4+5)","( 0;1>","( 1;5>","pow. 5"]
[1,null,null,2,3,4,5,null,null,1,null,null,2,3,4,5]
["1. łącznie (w. 2+3+4+5+6+7+8+9+10+11+12+13)",null,null,{"$f":"SUM(D54:D65)","v":0},{"$f":"SUM(E54:E65)","v":0},{"$f":"SUM(F54:F65)","v":0},{"$f":"SUM(G54:G65)","v":0},null,null,"1. łącznie (w. 2+3+4+5+6+7+8+9+10+11+12+13)",null,null,{"$f":"SUM(M54:M65)","v":0},{"$f":"SUM(N54:N65)","v":0},{"$f":"SUM(O54:O65)","v":0},{"$f":"SUM(P54:P65)","v":0}]
["2. grupa I",null,null,{"$f":"E54+F54+G54","v":0},null,null,null,null,null,"2. grupa I",null,null,{"$f":"N54+O54+P54","v":0}]
["3. grupa II",null,null,{"$f":"E55+F55+G55","v":0},null,null,null,null,null,"3. grupa II",null,null,{"$f":"N55+O55+P55","v":0}]
["4. grupa III",null,null,0,null,null,null,null,null,"4. grupa III",null,null,0]
["5.grupa IV",null,null,0,null,null,null,null,null,"5.grupa IV",null,null,0]
["6. bank centralny",null,null,0,null,null,null,null,null,"6. bank centralny",null,null,0]
["7. banki",null,null,0,null,null,null,null,null,"7. banki",null,null,0]
["8. pozostałe krajowe instytucje finansowe",null,null,0,null,null,null,null,null,"8. pozostałe krajowe instytucje finansowe",null,null,0]
["9. przedsiębiorstwa niefinansowe",null,null,0,null,null,null,null,null,"9. przedsiębiorstwa niefinansowe",null,null,0]
["10. gospodarstwa domowe",null,null,0,null,null,null,null,null,"10. gospodarstwa domowe",null,null,0]
["11. instytucje niekomercyjne działające na rzecz gospodarstw domowych",null,null,0,null,null,null,null,null,"11. instytucje niekomercyjne działające na rzecz gospodarstw domowych",null,null,0]
["12. podmioty nalezące do strefy euro",null,null,0,null,null,null,null,null,"12. podmioty nalezące do strefy euro",null,null,0]
["13. pozostałe podmioty zagraniczne",null,null,0,null,null,null,null,null,"13. pozostałe podmioty zagraniczne",null,null,0]
[]
[]
[]
[]
[]
[]
[]
[". . . . . . . . . . . . . . . . . . . . . . . . . . . . .  .  .",null,null,null,". . . . . . . . . . .",null,null,". . . . . . . . . . .",null,null,". . . . . . . . . . . . . . . . ."]
["Główny księgowy / Skarbnik",null,null,null,"telefon",null,null,"rok m-c dzień",null,null,"Kierownik jednostki (jednostki obsługującej)/ Przewodniczący Zarządu"]
["* Nie dotyczy sprawozdań zbiorczych sporządzanych przez RIO. W przypadku braku głównego księgowego podpisuje tylko kierownik jednostki."]

{"sheet":"42-samorz.inst.kult.","index":4,"n_rows":75,"n_cols":21,"rows_kept":75,"cut":false,"hidden":false,"merged":[[3,13,6,16],[8,2,8,4],[34,0,34,2],[22,0,22,1],[19,0,19,1],[20,0,20,1],[21,0,21,1],[29,9,29,11],[32,9,32,11],[33,9,33,11],[34,9,34,11],[29,12,29,15],[30,9,30,11],[31,9,31,11],[17,0,17,1],[18,0,18,1],[33,0,33,2],[32,0,32,2],[36,0,36,2],[35,0,35,2],[2,0,2,1],[5,0,5,1],[7,0,7,1],[9,2,9,4],[10,2,10,4],[61,0,61,2],[54,0,54,2],[55,0,55,2],[56,0,56,2],[55,9,55,11],[56,9,56,11],[54,9,54,11],[59,0,59,2],[58,0,58,2],[61,9,61,11],[52,0,52,2],[57,0,57,2],[52,9,52,11],[60,0,60,2],[53,9,53,11],[53,0,53,2],[57,9,57,11],[58,9,58,11],[59,9,59,11],[60,9,60,11],[49,12,49,15],[50,9,50,11],[35,9,35,11],[41,9,41,11],[42,9,42,11],[40,9,40,11],[36,9,36,11],[37,9,37,11],[38,9,38,11],[39,9,39,11],[43,9,43,11],[44,9,44,11],[49,9,49,11],[64,0,64,2],[62,9,62,11],[63,9,63,11],[64,9,64,11],[63,0,63,2],[62,0,62,2],[51,9,51,11],[45,0,45,1],[50,0,50,2],[49,0,49,2],[49,3,49,6],[51,0,51,2],[40,0,40,2],[41,0,41,2],[42,0,42,2],[43,0,43,2],[44,0,44,2],[39,0,39,2],[29,3,29,6],[15,5,16,5],[15,6,16,6],[14,0,16,1],[14,2,14,8],[15,2,16,2],[15,3,16,3],[15,4,16,4],[15,7,16,7],[15,8,16,8],[37,0,37,2],[38,0,38,2],[31,0,31,2],[29,0,29,2],[30,0,30,2]]}
[]
["Nazwa jednostki sprawozdawczej ",null,null,null,null,"Rb-UZ  ROCZNE SPRAWOZDANIE UZUPEŁNIAJĄCE O STANIE ZOBOWIĄZAŃ ",null,null,null,null,null,null,null,null,null,null,null,null,null,null,{"$f":"MAXA('20-państw.szk.wyż.:90-agencja wykonawcza'!U1)","v":0}]
[null,null,null,null,null,null,"WG TYTUŁÓW DŁUŻNYCH ",null,null,null,null,null,null,"Adresat:"]
[null,null,null,null,null,null,"samorządowej instytucji kultury"]
["Adres jednostki sprawozdawczej"]
[]
["Numer identyfikacyjny REGON",null,"liczba identyfik.jedn."]
[null,null,"",null,null,"wg stanu na koniec",null,4,"kwartału","  roku"]
["Nazwa województwa",null,null,null,null,null,null,"SYMBOLE"]
["Nazwa powiatu / związku",null,null,null,null,"WOJ.","POWIAT","GMINA","TYP GM.","ZWIĄZEK JST","TYP ZW.","GRUPA","CZĘŚĆ BUDŻ."]
["Nazwa gminy / związku",null,null,null,null,null,null,null,null,null,null,42]
[]
["A. Struktura walutowa tytułów dłużnych według wartości nominalnej "]
[]
["Wyszczególnienie",null,"W a l u t a"]
[null,null,"Ogółem (kol. 3+4+5+6+7)","PLN","EUR","USD","CHF","Pozostałe waluty wg średniego kursu NBP","Pozostałe waluty wg średniej arytmetycznej"]
[null,null,"Ogółem (kol. 3+4+5+6+7)",null,null,null,null,null,"Pozostałe waluty wg średniej arytmetycznej"]
[1,null,2,3,4,5,6,7,8]
["A. Zobowiązania ogółem (A1+A2+A3+A4)",null,{"$f":"D19+E19+F19+G19+H19","v":0},{"$f":"SUM(D20:D23)","v":0},0,0,0,0,0]
["A1. papiery wartościowe",null,{"$f":"D20+E20+F20+G20+H20","v":0}]
["A2. kredyty i pożyczki",null,{"$f":"D21+E21+F21+G21+H21","v":0}]
["A3. przyjęte depozyty",null,{"$f":"D22+E22+F22+G22+H22","v":0}]
["A4. wymagalne zobowiązania",null,{"$f":"D23+E23+F23+G23+H23","v":0}]
[]
[" B. Struktura terminowa zobowiązań z tytułu zaciagniętych kredytów i pożyczek oraz wyemitowanych papierów wartościowych"]
[]
[" B1. papiery wartościowe wg pierwotnego terminu zapadalności - stan na koniec okresu sprawozdawczego",null,null,null,null,null,null,null,null," B2. papiery wartościowe wg pozostałego terminu zapadalności - stan na koniec okresu sprawozdawczego"]
["      (wg wartości nominalnej)",null,null,null,null,null,null,null,null,"      (wg wartości nominalnej)"]
[]
["papiery wartościowe",null,null,"zapadalność w latach",null,null,null,null,null,"papiery wartościowe",null,null,"zapadalność w latach"]
["wierzyciele",null,null,"łącznie       (kol. 3+4+5)","( 0;1>","( 1;5>","pow. 5",null,null,"wierzyciele",null,null,"łącznie         (kol. 3+4+5)","( 0;1>","( 1;5>","pow. 5"]
[1,null,null,2,3,4,5,null,null,1,null,null,2,3,4,5]
["1. łącznie (w. 2+3+4+5+6+7+8+9+10+11+12+13)",null,null,{"$f":"SUM(D34:D45)","v":0},{"$f":"SUM(E34:E45)","v":0},{"$f":"SUM(F34:F45)","v":0},{"$f":"SUM(G34:G45)","v":0},null,null,"1. łącznie (w. 2+3+4+5+6+7+8+9+10+11+12+13)",null,null,{"$f":"SUM(M34:M45)","v":0},{"$f":"SUM(N34:N45)","v":0},{"$f":"SUM(O34:O45)","v":0},{"$f":"SUM(P34:P45)","v":0}]
["2. grupa I",null,null,{"$f":"E34+F34+G34","v":0},null,null,null,null,null,"2. grupa I",null,null,{"$f":"N34+O34+P34","v":0}]
["3. grupa II",null,null,{"$f":"E35+F35+G35","v":0},null,null,null,null,null,"3. grupa II",null,null,{"$f":"N35+O35+P35","v":0}]
["4. grupa III",null,null,0,null,null,null,null,null,"4. grupa III",null,null,0]
["5.grupa IV",null,null,0,null,null,null,null,null,"5.grupa IV",null,null,0]
["6. bank centralny",null,null,0,null,null,null,null,null,"6. bank centralny",null,null,0]
["7. banki",null,null,0,null,null,null,null,null,"7. banki",null,null,0]
["8. pozostałe krajowe instytucje finansowe",null,null,0,null,null,null,null,null,"8. pozostałe krajowe instytucje finansowe",null,null,0]
["9. przedsiębiorstwa niefinansowe",null,null,0,null,null,null,null,null,"9. przedsiębiorstwa niefinansowe",null,null,0]
["10. gospodarstwa domowe",null,null,0,null,null,null,null,null,"10. gospodarstwa domowe",null,null,0]
["11. instytucje niekomercyjne działające na rzecz gospodarstw domowych",null,null,0,null,null,null,null,null,"11. instytucje niekomercyjne działające na rzecz gospodarstw domowych",null,null,0]
["12. podmioty nalezące do strefy euro",null,null,0,null,null,null,null,null,"12. podmioty nalezące do strefy euro",null,null,0]
["13. pozostałe podmioty zagraniczne",null,null,0,null,null,null,null,null,"13. pozostałe podmioty zagraniczne",null,null,0]
[]
[" B3. kredyty i pożyczki wg pierwotnego terminu zapadalności - stan na koniec okresu sprawozdawczego",null,null,null,null,null,null,null,null," B4. kredyty i pożyczki wg pozostałego terminu zapadalności - stan na koniec okresu sprawozdawczego"]
["      (wg wartości nominalnej)",null,null,null,null,null,null,null,null,"      (wg wartości nominalnej)"]
[]
["kredyty i pożyczki",null,null,"zapadalność w latach",null,null,null,null,null,"kredyty i pożyczki",null,null,"zapadalność w latach"]
["wierzyciele",null,null,"łącznie       (kol. 3+4+5)","( 0;1>","( 1;5>","pow. 5",null,null,"wierzyciele",null,null,"łącznie         (kol. 3+4+5)","( 0;1>","( 1;5>","pow. 5"]
[1,null,null,2,3,4,5,null,null,1,null,null,2,3,4,5]
["1. łącznie (w. 2+3+4+5+6+7+8+9+10+11+12+13)",null,null,{"$f":"SUM(D54:D65)","v":0},{"$f":"SUM(E54:E65)","v":0},{"$f":"SUM(F54:F65)","v":0},{"$f":"SUM(G54:G65)","v":0},null,null,"1. łącznie (w. 2+3+4+5+6+7+8+9+10+11+12+13)",null,null,{"$f":"SUM(M54:M65)","v":0},{"$f":"SUM(N54:N65)","v":0},{"$f":"SUM(O54:O65)","v":0},{"$f":"SUM(P54:P65)","v":0}]
["2. grupa I",null,null,{"$f":"E54+F54+G54","v":0},null,null,null,null,null,"2. grupa I",null,null,{"$f":"N54+O54+P54","v":0}]
["3. grupa II",null,null,{"$f":"E55+F55+G55","v":0},null,null,null,null,null,"3. grupa II",null,null,{"$f":"N55+O55+P55","v":0}]
["4. grupa III",null,null,0,null,null,null,null,null,"4. grupa III",null,null,0]
["5.grupa IV",null,null,0,null,null,null,null,null,"5.grupa IV",null,null,0]
["6. bank centralny",null,null,0,null,null,null,null,null,"6. bank centralny",null,null,0]
["7. banki",null,null,0,null,null,null,null,null,"7. banki",null,null,0]
["8. pozostałe krajowe instytucje finansowe",null,null,0,null,null,null,null,null,"8. pozostałe krajowe instytucje finansowe",null,null,0]
["9. przedsiębiorstwa niefinansowe",null,null,0,null,null,null,null,null,"9. przedsiębiorstwa niefinansowe",null,null,0]
["10. gospodarstwa domowe",null,null,0,null,null,null,null,null,"10. gospodarstwa domowe",null,null,0]
["11. instytucje niekomercyjne działające na rzecz gospodarstw domowych",null,null,0,null,null,null,null,null,"11. instytucje niekomercyjne działające na rzecz gospodarstw domowych",null,null,0]
["12. podmioty nalezące do strefy euro",null,null,0,null,null,null,null,null,"12. podmioty nalezące do strefy euro",null,null,0]
["13. pozostałe podmioty zagraniczne",null,null,0,null,null,null,null,null,"13. pozostałe podmioty zagraniczne",null,null,0]
[]
[]
[]
[]
[]
[]
[]
[". . . . . . . . . . . . . . . . . . . . . . . . . . . . .  .  .",null,null,null,". . . . . . . . . . .",null,null,". . . . . . . . . . .",null,null,". . . . . . . . . . . . . . . . ."]
["Główny księgowy / Skarbnik",null,null,null,"telefon",null,null,"rok m-c dzień",null,null,"Kierownik jednostki (jednostki obsługującej)/ Przewodniczący Zarządu"]
["* Nie dotyczy sprawozdań zbiorczych sporządzanych przez RIO. W przypadku braku głównego księgowego podpisuje tylko kierownik jednostki."]

{"sheet":"50-PAN i jedn.tworz.przez PAN","index":5,"n_rows":75,"n_cols":21,"rows_kept":75,"cut":false,"hidden":false,"merged":[[3,13,6,16],[8,2,8,4],[34,0,34,2],[22,0,22,1],[19,0,19,1],[20,0,20,1],[21,0,21,1],[29,9,29,11],[32,9,32,11],[33,9,33,11],[34,9,34,11],[29,12,29,15],[30,9,30,11],[31,9,31,11],[17,0,17,1],[18,0,18,1],[33,0,33,2],[32,0,32,2],[36,0,36,2],[35,0,35,2],[2,0,2,1],[5,0,5,1],[7,0,7,1],[9,2,9,4],[10,2,10,4],[61,0,61,2],[54,0,54,2],[55,0,55,2],[56,0,56,2],[55,9,55,11],[56,9,56,11],[54,9,54,11],[59,0,59,2],[58,0,58,2],[61,9,61,11],[52,0,52,2],[57,0,57,2],[52,9,52,11],[60,0,60,2],[53,9,53,11],[53,0,53,2],[57,9,57,11],[58,9,58,11],[59,9,59,11],[60,9,60,11],[49,12,49,15],[50,9,50,11],[35,9,35,11],[41,9,41,11],[42,9,42,11],[40,9,40,11],[36,9,36,11],[37,9,37,11],[38,9,38,11],[39,9,39,11],[43,9,43,11],[44,9,44,11],[49,9,49,11],[64,0,64,2],[62,9,62,11],[63,9,63,11],[64,9,64,11],[63,0,63,2],[62,0,62,2],[51,9,51,11],[45,0,45,1],[50,0,50,2],[49,0,49,2],[49,3,49,6],[51,0,51,2],[40,0,40,2],[41,0,41,2],[42,0,42,2],[43,0,43,2],[44,0,44,2],[39,0,39,2],[29,3,29,6],[15,5,16,5],[15,6,16,6],[14,0,16,1],[14,2,14,8],[15,2,16,2],[15,3,16,3],[15,4,16,4],[15,7,16,7],[15,8,16,8],[37,0,37,2],[38,0,38,2],[31,0,31,2],[29,0,29,2],[30,0,30,2]]}
[]
["Nazwa jednostki sprawozdawczej ",null,null,null,null,"Rb-UZ  ROCZNE SPRAWOZDANIE UZUPEŁNIAJĄCE O STANIE ZOBOWIĄZAŃ ",null,null,null,null,null,null,null,null,null,null,null,null,null,null,{"$f":"MAXA('20-państw.szk.wyż.:90-agencja wykonawcza'!U1)","v":0}]
[null,null,null,null,null,null,"WG TYTUŁÓW DŁUŻNYCH ",null,null,null,null,null,null,"Adresat:"]
[null,null,null,null,null,"PAN i jednostki organizacyjnej tworzonej przez PAN"]
["Adres jednostki sprawozdawczej"]
[]
["Numer identyfikacyjny REGON",null,"liczba identyfik.jedn."]
[null,null,"",null,null,"wg stanu na koniec",null,4,"kwartału","  roku"]
["Nazwa województwa",null,null,null,null,null,null,"SYMBOLE"]
["Nazwa powiatu / związku",null,null,null,null,"WOJ.","POWIAT","GMINA","TYP GM.","ZWIĄZEK JST","TYP ZW.","GRUPA","CZĘŚĆ BUDŻ."]
["Nazwa gminy / związku",null,null,null,null,null,null,null,null,null,null,50]
[]
["A. Struktura walutowa tytułów dłużnych według wartości nominalnej "]
[]
["Wyszczególnienie",null,"W a l u t a"]
[null,null,"Ogółem (kol. 3+4+5+6+7)","PLN","EUR","USD","CHF","Pozostałe waluty wg średniego kursu NBP","Pozostałe waluty wg średniej arytmetycznej"]
[null,null,"Ogółem (kol. 3+4+5+6+7)",null,null,null,null,null,"Pozostałe waluty wg średniej arytmetycznej"]
[1,null,2,3,4,5,6,7,8]
["A. Zobowiązania ogółem (A1+A2+A3+A4)",null,{"$f":"D19+E19+F19+G19+H19","v":0},{"$f":"SUM(D20:D23)","v":0},0,0,0,0,0]
["A1. papiery wartościowe",null,{"$f":"D20+E20+F20+G20+H20","v":0}]
["A2. kredyty i pożyczki",null,{"$f":"D21+E21+F21+G21+H21","v":0}]
["A3. przyjęte depozyty",null,{"$f":"D22+E22+F22+G22+H22","v":0}]
["A4. wymagalne zobowiązania",null,{"$f":"D23+E23+F23+G23+H23","v":0}]
[]
[" B. Struktura terminowa zobowiązań z tytułu zaciagniętych kredytów i pożyczek oraz wyemitowanych papierów wartościowych"]
[]
[" B1. papiery wartościowe wg pierwotnego terminu zapadalności - stan na koniec okresu sprawozdawczego",null,null,null,null,null,null,null,null," B2. papiery wartościowe wg pozostałego terminu zapadalności - stan na koniec okresu sprawozdawczego"]
["      (wg wartości nominalnej)",null,null,null,null,null,null,null,null,"      (wg wartości nominalnej)"]
[]
["papiery wartościowe",null,null,"zapadalność w latach",null,null,null,null,null,"papiery wartościowe",null,null,"zapadalność w latach"]
["wierzyciele",null,null,"łącznie       (kol. 3+4+5)","( 0;1>","( 1;5>","pow. 5",null,null,"wierzyciele",null,null,"łącznie         (kol. 3+4+5)","( 0;1>","( 1;5>","pow. 5"]
[1,null,null,2,3,4,5,null,null,1,null,null,2,3,4,5]
["1. łącznie (w. 2+3+4+5+6+7+8+9+10+11+12+13)",null,null,{"$f":"SUM(D34:D45)","v":0},{"$f":"SUM(E34:E45)","v":0},{"$f":"SUM(F34:F45)","v":0},{"$f":"SUM(G34:G45)","v":0},null,null,"1. łącznie (w. 2+3+4+5+6+7+8+9+10+11+12+13)",null,null,{"$f":"SUM(M34:M45)","v":0},{"$f":"SUM(N34:N45)","v":0},{"$f":"SUM(O34:O45)","v":0},{"$f":"SUM(P34:P45)","v":0}]
["2. grupa I",null,null,{"$f":"E34+F34+G34","v":0},null,null,null,null,null,"2. grupa I",null,null,{"$f":"N34+O34+P34","v":0}]
["3. grupa II",null,null,{"$f":"E35+F35+G35","v":0},null,null,null,null,null,"3. grupa II",null,null,{"$f":"N35+O35+P35","v":0}]
["4. grupa III",null,null,0,null,null,null,null,null,"4. grupa III",null,null,0]
["5.grupa IV",null,null,0,null,null,null,null,null,"5.grupa IV",null,null,0]
["6. bank centralny",null,null,0,null,null,null,null,null,"6. bank centralny",null,null,0]
["7. banki",null,null,0,null,null,null,null,null,"7. banki",null,null,0]
["8. pozostałe krajowe instytucje finansowe",null,null,0,null,null,null,null,null,"8. pozostałe krajowe instytucje finansowe",null,null,0]
["9. przedsiębiorstwa niefinansowe",null,null,0,null,null,null,null,null,"9. przedsiębiorstwa niefinansowe",null,null,0]
["10. gospodarstwa domowe",null,null,0,null,null,null,null,null,"10. gospodarstwa domowe",null,null,0]
["11. instytucje niekomercyjne działające na rzecz gospodarstw domowych",null,null,0,null,null,null,null,null,"11. instytucje niekomercyjne działające na rzecz gospodarstw domowych",null,null,0]
["12. podmioty nalezące do strefy euro",null,null,0,null,null,null,null,null,"12. podmioty nalezące do strefy euro",null,null,0]
["13. pozostałe podmioty zagraniczne",null,null,0,null,null,null,null,null,"13. pozostałe podmioty zagraniczne",null,null,0]
[]
[" B3. kredyty i pożyczki wg pierwotnego terminu zapadalności - stan na koniec okresu sprawozdawczego",null,null,null,null,null,null,null,null," B4. kredyty i pożyczki wg pozostałego terminu zapadalności - stan na koniec okresu sprawozdawczego"]
["      (wg wartości nominalnej)",null,null,null,null,null,null,null,null,"      (wg wartości nominalnej)"]
[]
["kredyty i pożyczki",null,null,"zapadalność w latach",null,null,null,null,null,"kredyty i pożyczki",null,null,"zapadalność w latach"]
["wierzyciele",null,null,"łącznie       (kol. 3+4+5)","( 0;1>","( 1;5>","pow. 5",null,null,"wierzyciele",null,null,"łącznie         (kol. 3+4+5)","( 0;1>","( 1;5>","pow. 5"]
[1,null,null,2,3,4,5,null,null,1,null,null,2,3,4,5]
["1. łącznie (w. 2+3+4+5+6+7+8+9+10+11+12+13)",null,null,{"$f":"SUM(D54:D65)","v":0},{"$f":"SUM(E54:E65)","v":0},{"$f":"SUM(F54:F65)","v":0},{"$f":"SUM(G54:G65)","v":0},null,null,"1. łącznie (w. 2+3+4+5+6+7+8+9+10+11+12+13)",null,null,{"$f":"SUM(M54:M65)","v":0},{"$f":"SUM(N54:N65)","v":0},{"$f":"SUM(O54:O65)","v":0},{"$f":"SUM(P54:P65)","v":0}]
["2. grupa I",null,null,{"$f":"E54+F54+G54","v":0},null,null,null,null,null,"2. grupa I",null,null,{"$f":"N54+O54+P54","v":0}]
["3. grupa II",null,null,{"$f":"E55+F55+G55","v":0},null,null,null,null,null,"3. grupa II",null,null,{"$f":"N55+O55+P55","v":0}]
["4. grupa III",null,null,0,null,null,null,null,null,"4. grupa III",null,null,0]
["5.grupa IV",null,null,0,null,null,null,null,null,"5.grupa IV",null,null,0]
["6. bank centralny",null,null,0,null,null,null,null,null,"6. bank centralny",null,null,0]
["7. banki",null,null,0,null,null,null,null,null,"7. banki",null,null,0]
["8. pozostałe krajowe instytucje finansowe",null,null,0,null,null,null,null,null,"8. pozostałe krajowe instytucje finansowe",null,null,0]
["9. przedsiębiorstwa niefinansowe",null,null,0,null,null,null,null,null,"9. przedsiębiorstwa niefinansowe",null,null,0]
["10. gospodarstwa domowe",null,null,0,null,null,null,null,null,"10. gospodarstwa domowe",null,null,0]
["11. instytucje niekomercyjne działające na rzecz gospodarstw domowych",null,null,0,null,null,null,null,null,"11. instytucje niekomercyjne działające na rzecz gospodarstw domowych",null,null,0]
["12. podmioty nalezące do strefy euro",null,null,0,null,null,null,null,null,"12. podmioty nalezące do strefy euro",null,null,0]
["13. pozostałe podmioty zagraniczne",null,null,0,null,null,null,null,null,"13. pozostałe podmioty zagraniczne",null,null,0]
[]
[]
[]
[]
[]
[]
[]
[". . . . . . . . . . . . . . . . . . . . . . . . . . . . .  .  .",null,null,null,". . . . . . . . . . .",null,null,". . . . . . . . . . .",null,null,". . . . . . . . . . . . . . . . ."]
["Główny księgowy / Skarbnik",null,null,null,"telefon",null,null,"rok m-c dzień",null,null,"Kierownik jednostki (jednostki obsługującej)/ Przewodniczący Zarządu"]
["* Nie dotyczy sprawozdań zbiorczych sporządzanych przez RIO. W przypadku braku głównego księgowego podpisuje tylko kierownik jednostki."]

{"sheet":"61-samodz.publ.ZOZ państw.","index":6,"n_rows":75,"n_cols":21,"rows_kept":75,"cut":false,"hidden":false,"merged":[[3,13,6,16],[3,3,3,10],[8,2,8,4],[15,4,16,4],[14,0,16,1],[14,2,14,8],[15,2,16,2],[15,7,16,7],[15,8,16,8],[15,6,16,6],[15,5,16,5],[15,3,16,3],[22,0,22,1],[19,0,19,1],[20,0,20,1],[21,0,21,1],[17,0,17,1],[18,0,18,1],[2,0,2,1],[5,0,5,1],[7,0,7,1],[9,2,9,4],[10,2,10,4],[35,0,35,2],[39,0,39,2],[29,3,29,6],[37,0,37,2],[38,0,38,2],[31,0,31,2],[29,0,29,2],[30,0,30,2],[33,0,33,2],[32,0,32,2],[34,0,34,2],[36,0,36,2],[44,9,44,11],[60,0,60,2],[61,0,61,2],[54,0,54,2],[55,0,55,2],[56,0,56,2],[59,0,59,2],[45,0,45,1],[49,3,49,6],[58,0,58,2],[53,0,53,2],[49,0,49,2],[51,0,51,2],[52,0,52,2],[57,0,57,2],[50,0,50,2],[40,0,40,2],[41,0,41,2],[42,0,42,2],[43,0,43,2],[44,0,44,2],[33,9,33,11],[34,9,34,11],[35,9,35,11],[43,9,43,11],[36,9,36,11],[37,9,37,11],[38,9,38,11],[39,9,39,11],[40,9,40,11],[41,9,41,11],[42,9,42,11],[29,9,29,11],[29,12,29,15],[30,9,30,11],[31,9,31,11],[32,9,32,11],[55,9,55,11],[56,9,56,11],[49,12,49,15],[50,9,50,11],[51,9,51,11],[52,9,52,11],[53,9,53,11],[54,9,54,11],[49,9,49,11],[64,0,64,2],[62,9,62,11],[63,9,63,11],[64,9,64,11],[63,0,63,2],[62,0,62,2],[61,9,61,11],[57,9,57,11],[58,9,58,11],[59,9,59,11],[60,9,60,11]]}
[]
["Nazwa jednostki sprawozdawczej ",null,null,null,null,"Rb-UZ  ROCZNE SPRAWOZDANIE UZUPEŁNIAJĄCE O STANIE ZOBOWIĄZAŃ ",null,null,null,null,null,null,null,null,null,null,null,null,null,null,{"$f":"MAXA('20-państw.szk.wyż.:90-agencja wykonawcza'!U1)","v":0}]
[null,null,null,null,null,null,"WG TYTUŁÓW DŁUŻNYCH ",null,null,null,null,null,null,"Adresat:"]
[null,null,null,"samodzielnego publicznego zakładu opieki zdrowotnej, dla którego podmiotem tworzącym jest minister, centralny organ administracji rządowej, wojewoda,  uczelnia medyczna"]
["Adres jednostki sprawozdawczej"]
[]
["Numer identyfikacyjny REGON",null,"liczba identyfik.jedn."]
[null,null,"",null,null,"wg stanu na koniec",null,4,"kwartału","  roku"]
["Nazwa województwa",null,null,null,null,null,null,"SYMBOLE"]
["Nazwa powiatu / związku",null,null,null,null,"WOJ.","POWIAT","GMINA","TYP GM.","ZWIĄZEK JST","TYP ZW.","GRUPA","CZĘŚĆ BUDŻ."]
["Nazwa gminy / związku",null,null,null,null,null,null,null,null,null,null,61]
[]
["A. Struktura walutowa tytułów dłużnych według wartości nominalnej "]
[]
["Wyszczególnienie",null,"W a l u t a"]
[null,null,"Ogółem (kol. 3+4+5+6+7)","PLN","EUR","USD","CHF","Pozostałe waluty wg średniego kursu NBP","Pozostałe waluty wg średniej arytmetycznej"]
[null,null,"Ogółem (kol. 3+4+5+6+7)",null,null,null,null,null,"Pozostałe waluty wg średniej arytmetycznej"]
[1,null,2,3,4,5,6,7,8]
["A. Zobowiązania ogółem (A1+A2+A3+A4)",null,{"$f":"D19+E19+F19+G19+H19","v":0},{"$f":"SUM(D20:D23)","v":0},0,0,0,0,0]
["A1. papiery wartościowe",null,{"$f":"D20+E20+F20+G20+H20","v":0}]
["A2. kredyty i pożyczki",null,{"$f":"D21+E21+F21+G21+H21","v":0}]
["A3. przyjęte depozyty",null,{"$f":"D22+E22+F22+G22+H22","v":0}]
["A4. wymagalne zobowiązania",null,{"$f":"D23+E23+F23+G23+H23","v":0}]
[]
[" B. Struktura terminowa zobowiązań z tytułu zaciagniętych kredytów i pożyczek oraz wyemitowanych papierów wartościowych"]
[]
[" B1. papiery wartościowe wg pierwotnego terminu zapadalności - stan na koniec okresu sprawozdawczego",null,null,null,null,null,null,null,null," B2. papiery wartościowe wg pozostałego terminu zapadalności - stan na koniec okresu sprawozdawczego"]
["      (wg wartości nominalnej)",null,null,null,null,null,null,null,null,"      (wg wartości nominalnej)"]
[]
["papiery wartościowe",null,null,"zapadalność w latach",null,null,null,null,null,"papiery wartościowe",null,null,"zapadalność w latach"]
["wierzyciele",null,null,"łącznie       (kol. 3+4+5)","( 0;1>","( 1;5>","pow. 5",null,null,"wierzyciele",null,null,"łącznie         (kol. 3+4+5)","( 0;1>","( 1;5>","pow. 5"]
[1,null,null,2,3,4,5,null,null,1,null,null,2,3,4,5]
["1. łącznie (w. 2+3+4+5+6+7+8+9+10+11+12+13)",null,null,{"$f":"SUM(D34:D45)","v":0},{"$f":"SUM(E34:E45)","v":0},{"$f":"SUM(F34:F45)","v":0},{"$f":"SUM(G34:G45)","v":0},null,null,"1. łącznie (w. 2+3+4+5+6+7+8+9+10+11+12+13)",null,null,{"$f":"SUM(M34:M45)","v":0},{"$f":"SUM(N34:N45)","v":0},{"$f":"SUM(O34:O45)","v":0},{"$f":"SUM(P34:P45)","v":0}]
["2. grupa I",null,null,{"$f":"E34+F34+G34","v":0},null,null,null,null,null,"2. grupa I",null,null,{"$f":"N34+O34+P34","v":0}]
["3. grupa II",null,null,{"$f":"E35+F35+G35","v":0},null,null,null,null,null,"3. grupa II",null,null,{"$f":"N35+O35+P35","v":0}]
["4. grupa III",null,null,0,null,null,null,null,null,"4. grupa III",null,null,0]
["5.grupa IV",null,null,0,null,null,null,null,null,"5.grupa IV",null,null,0]
["6. bank centralny",null,null,0,null,null,null,null,null,"6. bank centralny",null,null,0]
["7. banki",null,null,0,null,null,null,null,null,"7. banki",null,null,0]
["8. pozostałe krajowe instytucje finansowe",null,null,0,null,null,null,null,null,"8. pozostałe krajowe instytucje finansowe",null,null,0]
["9. przedsiębiorstwa niefinansowe",null,null,0,null,null,null,null,null,"9. przedsiębiorstwa niefinansowe",null,null,0]
["10. gospodarstwa domowe",null,null,0,null,null,null,null,null,"10. gospodarstwa domowe",null,null,0]
["11. instytucje niekomercyjne działające na rzecz gospodarstw domowych",null,null,0,null,null,null,null,null,"11. instytucje niekomercyjne działające na rzecz gospodarstw domowych",null,null,0]
["12. podmioty nalezące do strefy euro",null,null,0,null,null,null,null,null,"12. podmioty nalezące do strefy euro",null,null,0]
["13. pozostałe podmioty zagraniczne",null,null,0,null,null,null,null,null,"13. pozostałe podmioty zagraniczne",null,null,0]
[]
[" B3. kredyty i pożyczki wg pierwotnego terminu zapadalności - stan na koniec okresu sprawozdawczego",null,null,null,null,null,null,null,null," B4. kredyty i pożyczki wg pozostałego terminu zapadalności - stan na koniec okresu sprawozdawczego"]
["      (wg wartości nominalnej)",null,null,null,null,null,null,null,null,"      (wg wartości nominalnej)"]
[]
["kredyty i pożyczki",null,null,"zapadalność w latach",null,null,null,null,null,"kredyty i pożyczki",null,null,"zapadalność w latach"]
["wierzyciele",null,null,"łącznie       (kol. 3+4+5)","( 0;1>","( 1;5>","pow. 5",null,null,"wierzyciele",null,null,"łącznie         (kol. 3+4+5)","( 0;1>","( 1;5>","pow. 5"]
[1,null,null,2,3,4,5,null,null,1,null,null,2,3,4,5]
["1. łącznie (w. 2+3+4+5+6+7+8+9+10+11+12+13)",null,null,{"$f":"SUM(D54:D65)","v":0},{"$f":"SUM(E54:E65)","v":0},{"$f":"SUM(F54:F65)","v":0},{"$f":"SUM(G54:G65)","v":0},null,null,"1. łącznie (w. 2+3+4+5+6+7+8+9+10+11+12+13)",null,null,{"$f":"SUM(M54:M65)","v":0},{"$f":"SUM(N54:N65)","v":0},{"$f":"SUM(O54:O65)","v":0},{"$f":"SUM(P54:P65)","v":0}]
["2. grupa I",null,null,{"$f":"E54+F54+G54","v":0},null,null,null,null,null,"2. grupa I",null,null,{"$f":"N54+O54+P54","v":0}]
["3. grupa II",null,null,{"$f":"E55+F55+G55","v":0},null,null,null,null,null,"3. grupa II",null,null,{"$f":"N55+O55+P55","v":0}]
["4. grupa III",null,null,0,null,null,null,null,null,"4. grupa III",null,null,0]
["5.grupa IV",null,null,0,null,null,null,null,null,"5.grupa IV",null,null,0]
["6. bank centralny",null,null,0,null,null,null,null,null,"6. bank centralny",null,null,0]
["7. banki",null,null,0,null,null,null,null,null,"7. banki",null,null,0]
["8. pozostałe krajowe instytucje finansowe",null,null,0,null,null,null,null,null,"8. pozostałe krajowe instytucje finansowe",null,null,0]
["9. przedsiębiorstwa niefinansowe",null,null,0,null,null,null,null,null,"9. przedsiębiorstwa niefinansowe",null,null,0]
["10. gospodarstwa domowe",null,null,0,null,null,null,null,null,"10. gospodarstwa domowe",null,null,0]
["11. instytucje niekomercyjne działające na rzecz gospodarstw domowych",null,null,0,null,null,null,null,null,"11. instytucje niekomercyjne działające na rzecz gospodarstw domowych",null,null,0]
["12. podmioty nalezące do strefy euro",null,null,0,null,null,null,null,null,"12. podmioty nalezące do strefy euro",null,null,0]
["13. pozostałe podmioty zagraniczne",null,null,0,null,null,null,null,null,"13. pozostałe podmioty zagraniczne",null,null,0]
[]
[]
[]
[]
[]
[]
[]
[". . . . . . . . . . . . . . . . . . . . . . . . . . . . .  .  .",null,null,null,". . . . . . . . . . .",null,null,". . . . . . . . . . .",null,null,". . . . . . . . . . . . . . . . ."]
["Główny księgowy / Skarbnik",null,null,null,"telefon",null,null,"rok m-c dzień",null,null,"Kierownik jednostki (jednostki obsługującej)/ Przewodniczący Zarządu"]
["* Nie dotyczy sprawozdań zbiorczych sporządzanych przez RIO. W przypadku braku głównego księgowego podpisuje tylko kierownik jednostki."]

{"sheet":"62-samodz.publ.ZOZ samorz.","index":7,"n_rows":75,"n_cols":21,"rows_kept":75,"cut":false,"hidden":false,"merged":[[3,13,6,16],[8,2,8,4],[34,0,34,2],[22,0,22,1],[19,0,19,1],[20,0,20,1],[21,0,21,1],[29,9,29,11],[32,9,32,11],[33,9,33,11],[34,9,34,11],[29,12,29,15],[30,9,30,11],[31,9,31,11],[17,0,17,1],[18,0,18,1],[33,0,33,2],[32,0,32,2],[36,0,36,2],[35,0,35,2],[2,0,2,1],[5,0,5,1],[7,0,7,1],[9,2,9,4],[10,2,10,4],[61,0,61,2],[54,0,54,2],[55,0,55,2],[56,0,56,2],[55,9,55,11],[56,9,56,11],[54,9,54,11],[59,0,59,2],[58,0,58,2],[61,9,61,11],[52,0,52,2],[57,0,57,2],[52,9,52,11],[60,0,60,2],[53,9,53,11],[53,0,53,2],[57,9,57,11],[58,9,58,11],[59,9,59,11],[60,9,60,11],[49,12,49,15],[50,9,50,11],[35,9,35,11],[41,9,41,11],[42,9,42,11],[40,9,40,11],[36,9,36,11],[37,9,37,11],[38,9,38,11],[39,9,39,11],[43,9,43,11],[44,9,44,11],[49,9,49,11],[64,0,64,2],[62,9,62,11],[63,9,63,11],[64,9,64,11],[63,0,63,2],[62,0,62,2],[51,9,51,11],[45,0,45,1],[50,0,50,2],[49,0,49,2],[49,3,49,6],[51,0,51,2],[40,0,40,2],[41,0,41,2],[42,0,42,2],[43,0,43,2],[44,0,44,2],[39,0,39,2],[29,3,29,6],[15,5,16,5],[15,6,16,6],[14,0,16,1],[14,2,14,8],[15,2,16,2],[15,3,16,3],[15,4,16,4],[15,7,16,7],[15,8,16,8],[37,0,37,2],[38,0,38,2],[31,0,31,2],[29,0,29,2],[30,0,30,2]]}
[]
["Nazwa jednostki sprawozdawczej ",null,null,null,null,"Rb-UZ  ROCZNE SPRAWOZDANIE UZUPEŁNIAJĄCE O STANIE ZOBOWIĄZAŃ ",null,null,null,null,null,null,null,null,null,null,null,null,null,null,{"$f":"MAXA('20-państw.szk.wyż.:90-agencja wykonawcza'!U1)","v":0}]
[null,null,null,null,null,null,"WG TYTUŁÓW DŁUŻNYCH ",null,null,null,null,null,null,"Adresat:"]
[null,null,null,"samodzielnego publicznego zakładu opieki zdrowotnej, dla którego podmiotem tworzącym jest jednostka samorządu terytorialnego"]
["Adres jednostki sprawozdawczej"]
[]
["Numer identyfikacyjny REGON",null,"liczba identyfik.jedn."]
[null,null,"",null,null,"wg stanu na koniec",null,4,"kwartału","  roku"]
["Nazwa województwa",null,null,null,null,null,null,"SYMBOLE"]
["Nazwa powiatu / związku",null,null,null,null,"WOJ.","POWIAT","GMINA","TYP GM.","ZWIĄZEK JST","TYP ZW.","GRUPA","CZĘŚĆ BUDŻ."]
["Nazwa gminy / związku",null,null,null,null,null,null,null,null,null,null,62]
[]
["A. Struktura walutowa tytułów dłużnych według wartości nominalnej "]
[]
["Wyszczególnienie",null,"W a l u t a"]
[null,null,"Ogółem (kol. 3+4+5+6+7)","PLN","EUR","USD","CHF","Pozostałe waluty wg średniego kursu NBP","Pozostałe waluty wg średniej arytmetycznej"]
[null,null,"Ogółem (kol. 3+4+5+6+7)",null,null,null,null,null,"Pozostałe waluty wg średniej arytmetycznej"]
[1,null,2,3,4,5,6,7,8]
["A. Zobowiązania ogółem (A1+A2+A3+A4)",null,{"$f":"D19+E19+F19+G19+H19","v":0},{"$f":"SUM(D20:D23)","v":0},0,0,0,0,0]
["A1. papiery wartościowe",null,{"$f":"D20+E20+F20+G20+H20","v":0}]
["A2. kredyty i pożyczki",null,{"$f":"D21+E21+F21+G21+H21","v":0}]
["A3. przyjęte depozyty",null,{"$f":"D22+E22+F22+G22+H22","v":0}]
["A4. wymagalne zobowiązania",null,{"$f":"D23+E23+F23+G23+H23","v":0}]
[]
[" B. Struktura terminowa zobowiązań z tytułu zaciagniętych kredytów i pożyczek oraz wyemitowanych papierów wartościowych"]
[]
[" B1. papiery wartościowe wg pierwotnego terminu zapadalności - stan na koniec okresu sprawozdawczego",null,null,null,null,null,null,null,null," B2. papiery wartościowe wg pozostałego terminu zapadalności - stan na koniec okresu sprawozdawczego"]
["      (wg wartości nominalnej)",null,null,null,null,null,null,null,null,"      (wg wartości nominalnej)"]
[]
["papiery wartościowe",null,null,"zapadalność w latach",null,null,null,null,null,"papiery wartościowe",null,null,"zapadalność w latach"]
["wierzyciele",null,null,"łącznie       (kol. 3+4+5)","( 0;1>","( 1;5>","pow. 5",null,null,"wierzyciele",null,null,"łącznie         (kol. 3+4+5)","( 0;1>","( 1;5>","pow. 5"]
[1,null,null,2,3,4,5,null,null,1,null,null,2,3,4,5]
["1. łącznie (w. 2+3+4+5+6+7+8+9+10+11+12+13)",null,null,{"$f":"SUM(D34:D45)","v":0},{"$f":"SUM(E34:E45)","v":0},{"$f":"SUM(F34:F45)","v":0},{"$f":"SUM(G34:G45)","v":0},null,null,"1. łącznie (w. 2+3+4+5+6+7+8+9+10+11+12+13)",null,null,{"$f":"SUM(M34:M45)","v":0},{"$f":"SUM(N34:N45)","v":0},{"$f":"SUM(O34:O45)","v":0},{"$f":"SUM(P34:P45)","v":0}]
["2. grupa I",null,null,{"$f":"E34+F34+G34","v":0},null,null,null,null,null,"2. grupa I",null,null,{"$f":"N34+O34+P34","v":0}]
["3. grupa II",null,null,{"$f":"E35+F35+G35","v":0},null,null,null,null,null,"3. grupa II",null,null,{"$f":"N35+O35+P35","v":0}]
["4. grupa III",null,null,0,null,null,null,null,null,"4. grupa III",null,null,0]
["5.grupa IV",null,null,0,null,null,null,null,null,"5.grupa IV",null,null,0]
["6. bank centralny",null,null,0,null,null,null,null,null,"6. bank centralny",null,null,0]
["7. banki",null,null,0,null,null,null,null,null,"7. banki",null,null,0]
["8. pozostałe krajowe instytucje finansowe",null,null,0,null,null,null,null,null,"8. pozostałe krajowe instytucje finansowe",null,null,0]
["9. przedsiębiorstwa niefinansowe",null,null,0,null,null,null,null,null,"9. przedsiębiorstwa niefinansowe",null,null,0]
["10. gospodarstwa domowe",null,null,0,null,null,null,null,null,"10. gospodarstwa domowe",null,null,0]
["11. instytucje niekomercyjne działające na rzecz gospodarstw domowych",null,null,0,null,null,null,null,null,"11. instytucje niekomercyjne działające na rzecz gospodarstw domowych",null,null,0]
["12. podmioty nalezące do strefy euro",null,null,0,null,null,null,null,null,"12. podmioty nalezące do strefy euro",null,null,0]
["13. pozostałe podmioty zagraniczne",null,null,0,null,null,null,null,null,"13. pozostałe podmioty zagraniczne",null,null,0]
[]
[" B3. kredyty i pożyczki wg pierwotnego terminu zapadalności - stan na koniec okresu sprawozdawczego",null,null,null,null,null,null,null,null," B4. kredyty i pożyczki wg pozostałego terminu zapadalności - stan na koniec okresu sprawozdawczego"]
["      (wg wartości nominalnej)",null,null,null,null,null,null,null,null,"      (wg wartości nominalnej)"]
[]
["kredyty i pożyczki",null,null,"zapadalność w latach",null,null,null,null,null,"kredyty i pożyczki",null,null,"zapadalność w latach"]
["wierzyciele",null,null,"łącznie       (kol. 3+4+5)","( 0;1>","( 1;5>","pow. 5",null,null,"wierzyciele",null,null,"łącznie         (kol. 3+4+5)","( 0;1>","( 1;5>","pow. 5"]
[1,null,null,2,3,4,5,null,null,1,null,null,2,3,4,5]
["1. łącznie (w. 2+3+4+5+6+7+8+9+10+11+12+13)",null,null,{"$f":"SUM(D54:D65)","v":0},{"$f":"SUM(E54:E65)","v":0},{"$f":"SUM(F54:F65)","v":0},{"$f":"SUM(G54:G65)","v":0},null,null,"1. łącznie (w. 2+3+4+5+6+7+8+9+10+11+12+13)",null,null,{"$f":"SUM(M54:M65)","v":0},{"$f":"SUM(N54:N65)","v":0},{"$f":"SUM(O54:O65)","v":0},{"$f":"SUM(P54:P65)","v":0}]
["2. grupa I",null,null,{"$f":"E54+F54+G54","v":0},null,null,null,null,null,"2. grupa I",null,null,{"$f":"N54+O54+P54","v":0}]
["3. grupa II",null,null,{"$f":"E55+F55+G55","v":0},null,null,null,null,null,"3. grupa II",null,null,{"$f":"N55+O55+P55","v":0}]
["4. grupa III",null,null,0,null,null,null,null,null,"4. grupa III",null,null,0]
["5.grupa IV",null,null,0,null,null,null,null,null,"5.grupa IV",null,null,0]
["6. bank centralny",null,null,0,null,null,null,null,null,"6. bank centralny",null,null,0]
["7. banki",null,null,0,null,null,null,null,null,"7. banki",null,null,0]
["8. pozostałe krajowe instytucje finansowe",null,null,0,null,null,null,null,null,"8. pozostałe krajowe instytucje finansowe",null,null,0]
["9. przedsiębiorstwa niefinansowe",null,null,0,null,null,null,null,null,"9. przedsiębiorstwa niefinansowe",null,null,0]
["10. gospodarstwa domowe",null,null,0,null,null,null,null,null,"10. gospodarstwa domowe",null,null,0]
["11. instytucje niekomercyjne działające na rzecz gospodarstw domowych",null,null,0,null,null,null,null,null,"11. instytucje niekomercyjne działające na rzecz gospodarstw domowych",null,null,0]
["12. podmioty nalezące do strefy euro",null,null,0,null,null,null,null,null,"12. podmioty nalezące do strefy euro",null,null,0]
["13. pozostałe podmioty zagraniczne",null,null,0,null,null,null,null,null,"13. pozostałe podmioty zagraniczne",null,null,0]
[]
[]
[]
[]
[]
[]
[]
[". . . . . . . . . . . . . . . . . . . . . . . . . . . . .  .  .",null,null,null,". . . . . . . . . . .",null,null,". . . . . . . . . . .",null,null,". . . . . . . . . . . . . . . . ."]
["Główny księgowy / Skarbnik",null,null,null,"telefon",null,null,"rok m-c dzień",null,null,"Kierownik jednostki (jednostki obsługującej)/ Przewodniczący Zarządu"]
["* Nie dotyczy sprawozdań zbiorczych sporządzanych przez RIO. W przypadku braku głównego księgowego podpisuje tylko kierownik jednostki."]

{"sheet":"63-Narodowy Fundusz Zdrowia","index":8,"n_rows":75,"n_cols":21,"rows_kept":75,"cut":false,"hidden":false,"merged":[[3,13,6,16],[8,2,8,4],[34,0,34,2],[22,0,22,1],[19,0,19,1],[20,0,20,1],[21,0,21,1],[29,9,29,11],[32,9,32,11],[33,9,33,11],[34,9,34,11],[29,12,29,15],[30,9,30,11],[31,9,31,11],[17,0,17,1],[18,0,18,1],[33,0,33,2],[32,0,32,2],[36,0,36,2],[35,0,35,2],[2,0,2,1],[5,0,5,1],[7,0,7,1],[9,2,9,4],[10,2,10,4],[61,0,61,2],[54,0,54,2],[55,0,55,2],[56,0,56,2],[55,9,55,11],[56,9,56,11],[54,9,54,11],[59,0,59,2],[58,0,58,2],[61,9,61,11],[52,0,52,2],[57,0,57,2],[52,9,52,11],[60,0,60,2],[53,9,53,11],[53,0,53,2],[57,9,57,11],[58,9,58,11],[59,9,59,11],[60,9,60,11],[49,12,49,15],[50,9,50,11],[35,9,35,11],[41,9,41,11],[42,9,42,11],[40,9,40,11],[36,9,36,11],[37,9,37,11],[38,9,38,11],[39,9,39,11],[43,9,43,11],[44,9,44,11],[49,9,49,11],[64,0,64,2],[62,9,62,11],[63,9,63,11],[64,9,64,11],[63,0,63,2],[62,0,62,2],[51,9,51,11],[45,0,45,1],[50,0,50,2],[49,0,49,2],[49,3,49,6],[51,0,51,2],[40,0,40,2],[41,0,41,2],[42,0,42,2],[43,0,43,2],[44,0,44,2],[39,0,39,2],[29,3,29,6],[15,5,16,5],[15,6,16,6],[14,0,16,1],[14,2,14,8],[15,2,16,2],[15,3,16,3],[15,4,16,4],[15,7,16,7],[15,8,16,8],[37,0,37,2],[38,0,38,2],[31,0,31,2],[29,0,29,2],[30,0,30,2]]}
[]
["Nazwa jednostki sprawozdawczej ",null,null,null,null,"Rb-UZ  ROCZNE SPRAWOZDANIE UZUPEŁNIAJĄCE O STANIE ZOBOWIĄZAŃ ",null,null,null,null,null,null,null,null,null,null,null,null,null,null,{"$f":"MAXA('20-państw.szk.wyż.:90-agencja wykonawcza'!U1)","v":0}]
[null,null,null,null,null,null,"WG TYTUŁÓW DŁUŻNYCH ",null,null,null,null,null,null,"Adresat:"]
[null,null,null,null,null,null,"Narodowego Funduszu Zdrowia"]
["Adres jednostki sprawozdawczej"]
[]
["Numer identyfikacyjny REGON",null,"liczba identyfik.jedn."]
[null,null,"",null,null,"wg stanu na koniec",null,4,"kwartału","  roku"]
["Nazwa województwa",null,null,null,null,null,null,"SYMBOLE"]
["Nazwa powiatu / związku",null,null,null,null,"WOJ.","POWIAT","GMINA","TYP GM.","ZWIĄZEK JST","TYP ZW.","GRUPA","CZĘŚĆ BUDŻ."]
["Nazwa gminy / związku",null,null,null,null,null,null,null,null,null,null,63]
[]
["A. Struktura walutowa tytułów dłużnych według wartości nominalnej "]
[]
["Wyszczególnienie",null,"W a l u t a"]
[null,null,"Ogółem (kol. 3+4+5+6+7)","PLN","EUR","USD","CHF","Pozostałe waluty wg średniego kursu NBP","Pozostałe waluty wg średniej arytmetycznej"]
[null,null,"Ogółem (kol. 3+4+5+6+7)",null,null,null,null,null,"Pozostałe waluty wg średniej arytmetycznej"]
[1,null,2,3,4,5,6,7,8]
["A. Zobowiązania ogółem (A1+A2+A3+A4)",null,{"$f":"D19+E19+F19+G19+H19","v":0},{"$f":"SUM(D20:D23)","v":0},0,0,0,0,0]
["A1. papiery wartościowe",null,{"$f":"D20+E20+F20+G20+H20","v":0}]
["A2. kredyty i pożyczki",null,{"$f":"D21+E21+F21+G21+H21","v":0}]
["A3. przyjęte depozyty",null,{"$f":"D22+E22+F22+G22+H22","v":0}]
["A4. wymagalne zobowiązania",null,{"$f":"D23+E23+F23+G23+H23","v":0}]
[]
[" B. Struktura terminowa zobowiązań z tytułu zaciagniętych kredytów i pożyczek oraz wyemitowanych papierów wartościowych"]
[]
[" B1. papiery wartościowe wg pierwotnego terminu zapadalności - stan na koniec okresu sprawozdawczego",null,null,null,null,null,null,null,null," B2. papiery wartościowe wg pozostałego terminu zapadalności - stan na koniec okresu sprawozdawczego"]
["      (wg wartości nominalnej)",null,null,null,null,null,null,null,null,"      (wg wartości nominalnej)"]
[]
["papiery wartościowe",null,null,"zapadalność w latach",null,null,null,null,null,"papiery wartościowe",null,null,"zapadalność w latach"]
["wierzyciele",null,null,"łącznie       (kol. 3+4+5)","( 0;1>","( 1;5>","pow. 5",null,null,"wierzyciele",null,null,"łącznie         (kol. 3+4+5)","( 0;1>","( 1;5>","pow. 5"]
[1,null,null,2,3,4,5,null,null,1,null,null,2,3,4,5]
["1. łącznie (w. 2+3+4+5+6+7+8+9+10+11+12+13)",null,null,{"$f":"SUM(D34:D45)","v":0},{"$f":"SUM(E34:E45)","v":0},{"$f":"SUM(F34:F45)","v":0},{"$f":"SUM(G34:G45)","v":0},null,null,"1. łącznie (w. 2+3+4+5+6+7+8+9+10+11+12+13)",null,null,{"$f":"SUM(M34:M45)","v":0},{"$f":"SUM(N34:N45)","v":0},{"$f":"SUM(O34:O45)","v":0},{"$f":"SUM(P34:P45)","v":0}]
["2. grupa I",null,null,{"$f":"E34+F34+G34","v":0},null,null,null,null,null,"2. grupa I",null,null,{"$f":"N34+O34+P34","v":0}]
["3. grupa II",null,null,{"$f":"E35+F35+G35","v":0},null,null,null,null,null,"3. grupa II",null,null,{"$f":"N35+O35+P35","v":0}]
["4. grupa III",null,null,0,null,null,null,null,null,"4. grupa III",null,null,0]
["5.grupa IV",null,null,0,null,null,null,null,null,"5.grupa IV",null,null,0]
["6. bank centralny",null,null,0,null,null,null,null,null,"6. bank centralny",null,null,0]
["7. banki",null,null,0,null,null,null,null,null,"7. banki",null,null,0]
["8. pozostałe krajowe instytucje finansowe",null,null,0,null,null,null,null,null,"8. pozostałe krajowe instytucje finansowe",null,null,0]
["9. przedsiębiorstwa niefinansowe",null,null,0,null,null,null,null,null,"9. przedsiębiorstwa niefinansowe",null,null,0]
["10. gospodarstwa domowe",null,null,0,null,null,null,null,null,"10. gospodarstwa domowe",null,null,0]
["11. instytucje niekomercyjne działające na rzecz gospodarstw domowych",null,null,0,null,null,null,null,null,"11. instytucje niekomercyjne działające na rzecz gospodarstw domowych",null,null,0]
["12. podmioty nalezące do strefy euro",null,null,0,null,null,null,null,null,"12. podmioty nalezące do strefy euro",null,null,0]
["13. pozostałe podmioty zagraniczne",null,null,0,null,null,null,null,null,"13. pozostałe podmioty zagraniczne",null,null,0]
[]
[" B3. kredyty i pożyczki wg pierwotnego terminu zapadalności - stan na koniec okresu sprawozdawczego",null,null,null,null,null,null,null,null," B4. kredyty i pożyczki wg pozostałego terminu zapadalności - stan na koniec okresu sprawozdawczego"]
["      (wg wartości nominalnej)",null,null,null,null,null,null,null,null,"      (wg wartości nominalnej)"]
[]
["kredyty i pożyczki",null,null,"zapadalność w latach",null,null,null,null,null,"kredyty i pożyczki",null,null,"zapadalność w latach"]
["wierzyciele",null,null,"łącznie       (kol. 3+4+5)","( 0;1>","( 1;5>","pow. 5",null,null,"wierzyciele",null,null,"łącznie         (kol. 3+4+5)","( 0;1>","( 1;5>","pow. 5"]
[1,null,null,2,3,4,5,null,null,1,null,null,2,3,4,5]
["1. łącznie (w. 2+3+4+5+6+7+8+9+10+11+12+13)",null,null,{"$f":"SUM(D54:D65)","v":0},{"$f":"SUM(E54:E65)","v":0},{"$f":"SUM(F54:F65)","v":0},{"$f":"SUM(G54:G65)","v":0},null,null,"1. łącznie (w. 2+3+4+5+6+7+8+9+10+11+12+13)",null,null,{"$f":"SUM(M54:M65)","v":0},{"$f":"SUM(N54:N65)","v":0},{"$f":"SUM(O54:O65)","v":0},{"$f":"SUM(P54:P65)","v":0}]
["2. grupa I",null,null,{"$f":"E54+F54+G54","v":0},null,null,null,null,null,"2. grupa I",null,null,{"$f":"N54+O54+P54","v":0}]
["3. grupa II",null,null,{"$f":"E55+F55+G55","v":0},null,null,null,null,null,"3. grupa II",null,null,{"$f":"N55+O55+P55","v":0}]
["4. grupa III",null,null,0,null,null,null,null,null,"4. grupa III",null,null,0]
["5.grupa IV",null,null,0,null,null,null,null,null,"5.grupa IV",null,null,0]
["6. bank centralny",null,null,0,null,null,null,null,null,"6. bank centralny",null,null,0]
["7. banki",null,null,0,null,null,null,null,null,"7. banki",null,null,0]
["8. pozostałe krajowe instytucje finansowe",null,null,0,null,null,null,null,null,"8. pozostałe krajowe instytucje finansowe",null,null,0]
["9. przedsiębiorstwa niefinansowe",null,null,0,null,null,null,null,null,"9. przedsiębiorstwa niefinansowe",null,null,0]
["10. gospodarstwa domowe",null,null,0,null,null,null,null,null,"10. gospodarstwa domowe",null,null,0]
["11. instytucje niekomercyjne działające na rzecz gospodarstw domowych",null,null,0,null,null,null,null,null,"11. instytucje niekomercyjne działające na rzecz gospodarstw domowych",null,null,0]
["12. podmioty nalezące do strefy euro",null,null,0,null,null,null,null,null,"12. podmioty nalezące do strefy euro",null,null,0]
["13. pozostałe podmioty zagraniczne",null,null,0,null,null,null,null,null,"13. pozostałe podmioty zagraniczne",null,null,0]
[]
[]
[]
[]
[]
[]
[]
[". . . . . . . . . . . . . . . . . . . . . . . . . . . . .  .  .",null,null,null,". . . . . . . . . . .",null,null,". . . . . . . . . . .",null,null,". . . . . . . . . . . . . . . . ."]
["Główny księgowy / Skarbnik",null,null,null,"telefon",null,null,"rok m-c dzień",null,null,"Kierownik jednostki (jednostki obsługującej)/ Przewodniczący Zarządu"]
["* Nie dotyczy sprawozdań zbiorczych sporządzanych przez RIO. W przypadku braku głównego księgowego podpisuje tylko kierownik jednostki."]

{"sheet":"71-ZUS","index":9,"n_rows":75,"n_cols":21,"rows_kept":75,"cut":false,"hidden":false,"merged":[[2,0,2,1],[5,0,5,1],[7,0,7,1],[8,2,8,4],[9,2,9,4],[10,2,10,4],[19,0,19,1],[20,0,20,1],[15,2,16,2],[15,3,16,3],[15,4,16,4],[14,2,14,8],[15,7,16,7],[15,8,16,8],[21,0,21,1],[22,0,22,1],[29,0,29,2],[29,3,29,6],[29,9,29,11],[29,12,29,15],[30,0,30,2],[30,9,30,11],[31,0,31,2],[31,9,31,11],[32,0,32,2],[32,9,32,11],[33,0,33,2],[33,9,33,11],[34,0,34,2],[34,9,34,11],[35,0,35,2],[35,9,35,11],[36,0,36,2],[36,9,36,11],[37,0,37,2],[37,9,37,11],[38,0,38,2],[38,9,38,11],[39,0,39,2],[39,9,39,11],[40,0,40,2],[40,9,40,11],[41,0,41,2],[41,9,41,11],[42,0,42,2],[42,9,42,11],[43,0,43,2],[43,9,43,11],[44,0,44,2],[44,9,44,11],[45,0,45,1],[49,0,49,2],[49,3,49,6],[49,9,49,11],[53,9,53,11],[54,0,54,2],[54,9,54,11],[49,12,49,15],[50,0,50,2],[50,9,50,11],[51,0,51,2],[51,9,51,11],[52,0,52,2],[52,9,52,11],[53,0,53,2],[56,0,56,2],[56,9,56,11],[57,0,57,2],[57,9,57,11],[61,0,61,2],[61,9,61,11],[58,0,58,2],[58,9,58,11],[59,0,59,2],[59,9,59,11],[3,13,6,16],[64,0,64,2],[64,9,64,11],[62,0,62,2],[62,9,62,11],[63,0,63,2],[63,9,63,11],[60,0,60,2],[60,9,60,11],[17,0,17,1],[18,0,18,1],[15,5,16,5],[15,6,16,6],[14,0,16,1],[55,0,55,2],[55,9,55,11]]}
[]
["Nazwa jednostki sprawozdawczej ",null,null,null,null,"Rb-UZ  ROCZNE SPRAWOZDANIE UZUPEŁNIAJĄCE O STANIE ZOBOWIĄZAŃ ",null,null,null,null,null,null,null,null,null,null,null,null,null,null,{"$f":"MAXA('20-państw.szk.wyż.:90-agencja wykonawcza'!U1)","v":0}]
[null,null,null,null,null,null,"WG TYTUŁÓW DŁUŻNYCH ",null,null,null,null,null,null,"Adresat:"]
[null,null,null,null,null,null,"ZUS"]
["Adres jednostki sprawozdawczej"]
[]
["Numer identyfikacyjny REGON",null,"liczba identyfik.jedn."]
[null,null,"",null,null,"wg stanu na koniec",null,4,"kwartału","  roku"]
["Nazwa województwa",null,null,null,null,null,null,"SYMBOLE"]
["Nazwa powiatu / związku",null,null,null,null,"WOJ.","POWIAT","GMINA","TYP GM.","ZWIĄZEK JST","TYP ZW.","GRUPA","CZĘŚĆ BUDŻ."]
["Nazwa gminy / związku",null,null,null,null,null,null,null,null,null,null,71]
[]
["A. Struktura walutowa tytułów dłużnych według wartości nominalnej "]
[]
["Wyszczególnienie",null,"W a l u t a"]
[null,null,"Ogółem (kol. 3+4+5+6+7)","PLN","EUR","USD","CHF","Pozostałe waluty wg średniego kursu NBP","Pozostałe waluty wg średniej arytmetycznej"]
[null,null,"Ogółem (kol. 3+4+5+6+7)",null,null,null,null,null,"Pozostałe waluty wg średniej arytmetycznej"]
[1,null,2,3,4,5,6,7,8]
["A. Zobowiązania ogółem (A1+A2+A3+A4)",null,{"$f":"D19+E19+F19+G19+H19","v":0},{"$f":"SUM(D20:D23)","v":0},0,0,0,0,0]
["A1. papiery wartościowe",null,{"$f":"D20+E20+F20+G20+H20","v":0}]
["A2. kredyty i pożyczki",null,{"$f":"D21+E21+F21+G21+H21","v":0}]
["A3. przyjęte depozyty",null,{"$f":"D22+E22+F22+G22+H22","v":0}]
["A4. wymagalne zobowiązania",null,{"$f":"D23+E23+F23+G23+H23","v":0}]
[]
[" B. Struktura terminowa zobowiązań z tytułu zaciagniętych kredytów i pożyczek oraz wyemitowanych papierów wartościowych"]
[]
[" B1. papiery wartościowe wg pierwotnego terminu zapadalności - stan na koniec okresu sprawozdawczego",null,null,null,null,null,null,null,null," B2. papiery wartościowe wg pozostałego terminu zapadalności - stan na koniec okresu sprawozdawczego"]
["      (wg wartości nominalnej)",null,null,null,null,null,null,null,null,"      (wg wartości nominalnej)"]
[]
["papiery wartościowe",null,null,"zapadalność w latach",null,null,null,null,null,"papiery wartościowe",null,null,"zapadalność w latach"]
["wierzyciele",null,null,"łącznie       (kol. 3+4+5)","( 0;1>","( 1;5>","pow. 5",null,null,"wierzyciele",null,null,"łącznie         (kol. 3+4+5)","( 0;1>","( 1;5>","pow. 5"]
[1,null,null,2,3,4,5,null,null,1,null,null,2,3,4,5]
["1. łącznie (w. 2+3+4+5+6+7+8+9+10+11+12+13)",null,null,{"$f":"SUM(D34:D45)","v":0},{"$f":"SUM(E34:E45)","v":0},{"$f":"SUM(F34:F45)","v":0},{"$f":"SUM(G34:G45)","v":0},null,null,"1. łącznie (w. 2+3+4+5+6+7+8+9+10+11+12+13)",null,null,{"$f":"SUM(M34:M45)","v":0},{"$f":"SUM(N34:N45)","v":0},{"$f":"SUM(O34:O45)","v":0},{"$f":"SUM(P34:P45)","v":0}]
["2. grupa I",null,null,{"$f":"E34+F34+G34","v":0},null,null,null,null,null,"2. grupa I",null,null,{"$f":"N34+O34+P34","v":0}]
["3. grupa II",null,null,0,null,null,null,null,null,"3. grupa II",null,null,0]
["4. grupa III",null,null,0,null,null,null,null,null,"4. grupa III",null,null,0]
["5.grupa IV",null,null,0,null,null,null,null,null,"5.grupa IV",null,null,0]
["6. bank centralny",null,null,0,null,null,null,null,null,"6. bank centralny",null,null,0]
["7. banki",null,null,0,null,null,null,null,null,"7. banki",null,null,0]
["8. pozostałe krajowe instytucje finansowe",null,null,0,null,null,null,null,null,"8. pozostałe krajowe instytucje finansowe",null,null,0]
["9. przedsiębiorstwa niefinansowe",null,null,0,null,null,null,null,null,"9. przedsiębiorstwa niefinansowe",null,null,0]
["10. gospodarstwa domowe",null,null,0,null,null,null,null,null,"10. gospodarstwa domowe",null,null,0]
["11. instytucje niekomercyjne działające na rzecz gospodarstw domowych",null,null,0,null,null,null,null,null,"11. instytucje niekomercyjne działające na rzecz gospodarstw domowych",null,null,0]
["12. podmioty nalezące do strefy euro",null,null,0,null,null,null,null,null,"12. podmioty nalezące do strefy euro",null,null,0]
["13. pozostałe podmioty zagraniczne",null,null,0,null,null,null,null,null,"13. pozostałe podmioty zagraniczne",null,null,0]
[]
[" B3. kredyty i pożyczki wg pierwotnego terminu zapadalności - stan na koniec okresu sprawozdawczego",null,null,null,null,null,null,null,null," B4. kredyty i pożyczki wg pozostałego terminu zapadalności - stan na koniec okresu sprawozdawczego"]
["      (wg wartości nominalnej)",null,null,null,null,null,null,null,null,"      (wg wartości nominalnej)"]
[]
["kredyty i pożyczki",null,null,"zapadalność w latach",null,null,null,null,null,"kredyty i pożyczki",null,null,"zapadalność w latach"]
["wierzyciele",null,null,"łącznie       (kol. 3+4+5)","( 0;1>","( 1;5>","pow. 5",null,null,"wierzyciele",null,null,"łącznie         (kol. 3+4+5)","( 0;1>","( 1;5>","pow. 5"]
[1,null,null,2,3,4,5,null,null,1,null,null,2,3,4,5]
["1. łącznie (w. 2+3+4+5+6+7+8+9+10+11+12+13)",null,null,{"$f":"SUM(D54:D65)","v":0},{"$f":"SUM(E54:E65)","v":0},{"$f":"SUM(F54:F65)","v":0},{"$f":"SUM(G54:G65)","v":0},null,null,"1. łącznie (w. 2+3+4+5+6+7+8+9+10+11+12+13)",null,null,{"$f":"SUM(M54:M65)","v":0},{"$f":"SUM(N54:N65)","v":0},{"$f":"SUM(O54:O65)","v":0},{"$f":"SUM(P54:P65)","v":0}]
["2. grupa I",null,null,{"$f":"E54+F54+G54","v":0},null,null,null,null,null,"2. grupa I",null,null,{"$f":"N54+O54+P54","v":0}]
["3. grupa II",null,null,0,null,null,null,null,null,"3. grupa II",null,null,0]
["4. grupa III",null,null,0,null,null,null,null,null,"4. grupa III",null,null,0]
["5.grupa IV",null,null,0,null,null,null,null,null,"5.grupa IV",null,null,0]
["6. bank centralny",null,null,0,null,null,null,null,null,"6. bank centralny",null,null,0]
["7. banki",null,null,0,null,null,null,null,null,"7. banki",null,null,0]
["8. pozostałe krajowe instytucje finansowe",null,null,0,null,null,null,null,null,"8. pozostałe krajowe instytucje finansowe",null,null,0]
["9. przedsiębiorstwa niefinansowe",null,null,0,null,null,null,null,null,"9. przedsiębiorstwa niefinansowe",null,null,0]
["10. gospodarstwa domowe",null,null,0,null,null,null,null,null,"10. gospodarstwa domowe",null,null,0]
["11. instytucje niekomercyjne działające na rzecz gospodarstw domowych",null,null,0,null,null,null,null,null,"11. instytucje niekomercyjne działające na rzecz gospodarstw domowych",null,null,0]
["12. podmioty nalezące do strefy euro",null,null,0,null,null,null,null,null,"12. podmioty nalezące do strefy euro",null,null,0]
["13. pozostałe podmioty zagraniczne",null,null,0,null,null,null,null,null,"13. pozostałe podmioty zagraniczne",null,null,0]
[]
[]
[]
[]
[]
[]
[]
[". . . . . . . . . . . . . . . . . . . . . . . . . . . . .  .  .",null,null,null,". . . . . . . . . . .",null,null,". . . . . . . . . . .",null,null,". . . . . . . . . . . . . . . . ."]
["Główny księgowy / Skarbnik",null,null,null,"telefon",null,null,"rok m-c dzień",null,null,"Kierownik jednostki (jednostki obsługującej)/ Przewodniczący Zarządu"]
["* Nie dotyczy sprawozdań zbiorczych sporządzanych przez RIO. W przypadku braku głównego księgowego podpisuje tylko kierownik jednostki."]

{"sheet":"72-fund.zarz.przez ZUS","index":10,"n_rows":75,"n_cols":21,"rows_kept":75,"cut":false,"hidden":false,"merged":[[3,13,6,16],[64,0,64,2],[64,9,64,11],[62,0,62,2],[62,9,62,11],[63,0,63,2],[63,9,63,11],[60,0,60,2],[60,9,60,11],[61,0,61,2],[61,9,61,11],[58,0,58,2],[58,9,58,11],[59,0,59,2],[59,9,59,11],[56,0,56,2],[56,9,56,11],[57,0,57,2],[57,9,57,11],[54,0,54,2],[54,9,54,11],[55,0,55,2],[55,9,55,11],[52,0,52,2],[52,9,52,11],[53,0,53,2],[53,9,53,11],[49,12,49,15],[50,0,50,2],[50,9,50,11],[51,0,51,2],[51,9,51,11],[44,0,44,2],[44,9,44,11],[45,0,45,1],[49,0,49,2],[49,3,49,6],[49,9,49,11],[42,0,42,2],[42,9,42,11],[43,0,43,2],[43,9,43,11],[40,0,40,2],[40,9,40,11],[41,0,41,2],[41,9,41,11],[38,0,38,2],[38,9,38,11],[39,0,39,2],[39,9,39,11],[36,0,36,2],[36,9,36,11],[37,0,37,2],[37,9,37,11],[34,0,34,2],[34,9,34,11],[35,0,35,2],[35,9,35,11],[32,0,32,2],[32,9,32,11],[33,0,33,2],[33,9,33,11],[30,0,30,2],[30,9,30,11],[31,0,31,2],[31,9,31,11],[29,0,29,2],[29,3,29,6],[29,9,29,11],[18,0,18,1],[15,5,16,5],[15,6,16,6],[29,12,29,15],[19,0,19,1],[20,0,20,1],[21,0,21,1],[22,0,22,1],[2,0,2,1],[5,0,5,1],[7,0,7,1],[8,2,8,4],[17,0,17,1],[9,2,9,4],[10,2,10,4],[14,0,16,1],[14,2,14,8],[15,2,16,2],[15,3,16,3],[15,4,16,4],[15,7,16,7],[15,8,16,8]]}
[]
["Nazwa jednostki sprawozdawczej ",null,null,null,null,"Rb-UZ  ROCZNE SPRAWOZDANIE UZUPEŁNIAJĄCE O STANIE ZOBOWIĄZAŃ ",null,null,null,null,null,null,null,null,null,null,null,null,null,null,{"$f":"MAXA('20-państw.szk.wyż.:90-agencja wykonawcza'!U1)","v":0}]
[null,null,null,null,null,null,"WG TYTUŁÓW DŁUŻNYCH ",null,null,null,null,null,null,"Adresat:"]
[null,null,null,null,null,null,"funduszy zarządzanych przez ZUS"]
["Adres jednostki sprawozdawczej"]
[]
["Numer identyfikacyjny REGON",null,"liczba identyfik.jedn."]
[null,null,"",null,null,"wg stanu na koniec",null,4,"kwartału","  roku"]
["Nazwa województwa",null,null,null,null,null,null,"SYMBOLE"]
["Nazwa powiatu / związku",null,null,null,null,"WOJ.","POWIAT","GMINA","TYP GM.","ZWIĄZEK JST","TYP ZW.","GRUPA","CZĘŚĆ BUDŻ."]
["Nazwa gminy / związku",null,null,null,null,null,null,null,null,null,null,72]
[]
["A. Struktura walutowa tytułów dłużnych według wartości nominalnej "]
[]
["Wyszczególnienie",null,"W a l u t a"]
[null,null,"Ogółem (kol. 3+4+5+6+7)","PLN","EUR","USD","CHF","Pozostałe waluty wg średniego kursu NBP","Pozostałe waluty wg średniej arytmetycznej"]
[null,null,"Ogółem (kol. 3+4+5+6+7)",null,null,null,null,null,"Pozostałe waluty wg średniej arytmetycznej"]
[1,null,2,3,4,5,6,7,8]
["A. Zobowiązania ogółem (A1+A2+A3+A4)",null,{"$f":"D19+E19+F19+G19+H19","v":0},{"$f":"SUM(D20:D23)","v":0},0,0,0,0,0]
["A1. papiery wartościowe",null,{"$f":"D20+E20+F20+G20+H20","v":0}]
["A2. kredyty i pożyczki",null,{"$f":"D21+E21+F21+G21+H21","v":0}]
["A3. przyjęte depozyty",null,{"$f":"D22+E22+F22+G22+H22","v":0}]
["A4. wymagalne zobowiązania",null,{"$f":"D23+E23+F23+G23+H23","v":0}]
[]
[" B. Struktura terminowa zobowiązań z tytułu zaciagniętych kredytów i pożyczek oraz wyemitowanych papierów wartościowych"]
[]
[" B1. papiery wartościowe wg pierwotnego terminu zapadalności - stan na koniec okresu sprawozdawczego",null,null,null,null,null,null,null,null," B2. papiery wartościowe wg pozostałego terminu zapadalności - stan na koniec okresu sprawozdawczego"]
["      (wg wartości nominalnej)",null,null,null,null,null,null,null,null,"      (wg wartości nominalnej)"]
[]
["papiery wartościowe",null,null,"zapadalność w latach",null,null,null,null,null,"papiery wartościowe",null,null,"zapadalność w latach"]
["wierzyciele",null,null,"łącznie       (kol. 3+4+5)","( 0;1>","( 1;5>","pow. 5",null,null,"wierzyciele",null,null,"łącznie         (kol. 3+4+5)","( 0;1>","( 1;5>","pow. 5"]
[1,null,null,2,3,4,5,null,null,1,null,null,2,3,4,5]
["1. łącznie (w. 2+3+4+5+6+7+8+9+10+11+12+13)",null,null,{"$f":"SUM(D34:D45)","v":0},{"$f":"SUM(E34:E45)","v":0},{"$f":"SUM(F34:F45)","v":0},{"$f":"SUM(G34:G45)","v":0},null,null,"1. łącznie (w. 2+3+4+5+6+7+8+9+10+11+12+13)",null,null,{"$f":"SUM(M34:M45)","v":0},{"$f":"SUM(N34:N45)","v":0},{"$f":"SUM(O34:O45)","v":0},{"$f":"SUM(P34:P45)","v":0}]
["2. grupa I",null,null,{"$f":"E34+F34+G34","v":0},null,null,null,null,null,"2. grupa I",null,null,{"$f":"N34+O34+P34","v":0}]
["3. grupa II",null,null,{"$f":"E35+F35+G35","v":0},null,null,null,null,null,"3. grupa II",null,null,{"$f":"N35+O35+P35","v":0}]
["4. grupa III",null,null,0,null,null,null,null,null,"4. grupa III",null,null,0]
["5.grupa IV",null,null,0,null,null,null,null,null,"5.grupa IV",null,null,0]
["6. bank centralny",null,null,0,null,null,null,null,null,"6. bank centralny",null,null,0]
["7. banki",null,null,0,null,null,null,null,null,"7. banki",null,null,0]
["8. pozostałe krajowe instytucje finansowe",null,null,0,null,null,null,null,null,"8. pozostałe krajowe instytucje finansowe",null,null,0]
["9. przedsiębiorstwa niefinansowe",null,null,0,null,null,null,null,null,"9. przedsiębiorstwa niefinansowe",null,null,0]
["10. gospodarstwa domowe",null,null,0,null,null,null,null,null,"10. gospodarstwa domowe",null,null,0]
["11. instytucje niekomercyjne działające na rzecz gospodarstw domowych",null,null,0,null,null,null,null,null,"11. instytucje niekomercyjne działające na rzecz gospodarstw domowych",null,null,0]
["12. podmioty nalezące do strefy euro",null,null,0,null,null,null,null,null,"12. podmioty nalezące do strefy euro",null,null,0]
["13. pozostałe podmioty zagraniczne",null,null,0,null,null,null,null,null,"13. pozostałe podmioty zagraniczne",null,null,0]
[]
[" B3. kredyty i pożyczki wg pierwotnego terminu zapadalności - stan na koniec okresu sprawozdawczego",null,null,null,null,null,null,null,null," B4. kredyty i pożyczki wg pozostałego terminu zapadalności - stan na koniec okresu sprawozdawczego"]
["      (wg wartości nominalnej)",null,null,null,null,null,null,null,null,"      (wg wartości nominalnej)"]
[]
["kredyty i pożyczki",null,null,"zapadalność w latach",null,null,null,null,null,"kredyty i pożyczki",null,null,"zapadalność w latach"]
["wierzyciele",null,null,"łącznie       (kol. 3+4+5)","( 0;1>","( 1;5>","pow. 5",null,null,"wierzyciele",null,null,"łącznie         (kol. 3+4+5)","( 0;1>","( 1;5>","pow. 5"]
[1,null,null,2,3,4,5,null,null,1,null,null,2,3,4,5]
["1. łącznie (w. 2+3+4+5+6+7+8+9+10+11+12+13)",null,null,{"$f":"SUM(D54:D65)","v":0},{"$f":"SUM(E54:E65)","v":0},{"$f":"SUM(F54:F65)","v":0},{"$f":"SUM(G54:G65)","v":0},null,null,"1. łącznie (w. 2+3+4+5+6+7+8+9+10+11+12+13)",null,null,{"$f":"SUM(M54:M65)","v":0},{"$f":"SUM(N54:N65)","v":0},{"$f":"SUM(O54:O65)","v":0},{"$f":"SUM(P54:P65)","v":0}]
["2. grupa I",null,null,{"$f":"E54+F54+G54","v":0},null,null,null,null,null,"2. grupa I",null,null,{"$f":"N54+O54+P54","v":0}]
["3. grupa II",null,null,{"$f":"E55+F55+G55","v":0},null,null,null,null,null,"3. grupa II",null,null,{"$f":"N55+O55+P55","v":0}]
["4. grupa III",null,null,0,null,null,null,null,null,"4. grupa III",null,null,0]
["5.grupa IV",null,null,0,null,null,null,null,null,"5.grupa IV",null,null,0]
["6. bank centralny",null,null,0,null,null,null,null,null,"6. bank centralny",null,null,0]
["7. banki",null,null,0,null,null,null,null,null,"7. banki",null,null,0]
["8. pozostałe krajowe instytucje finansowe",null,null,0,null,null,null,null,null,"8. pozostałe krajowe instytucje finansowe",null,null,0]
["9. przedsiębiorstwa niefinansowe",null,null,0,null,null,null,null,null,"9. przedsiębiorstwa niefinansowe",null,null,0]
["10. gospodarstwa domowe",null,null,0,null,null,null,null,null,"10. gospodarstwa domowe",null,null,0]
["11. instytucje niekomercyjne działające na rzecz gospodarstw domowych",null,null,0,null,null,null,null,null,"11. instytucje niekomercyjne działające na rzecz gospodarstw domowych",null,null,0]
["12. podmioty nalezące do strefy euro",null,null,0,null,null,null,null,null,"12. podmioty nalezące do strefy euro",null,null,0]
["13. pozostałe podmioty zagraniczne",null,null,0,null,null,null,null,null,"13. pozostałe podmioty zagraniczne",null,null,0]
[]
[]
[]
[]
[]
[]
[]
[". . . . . . . . . . . . . . . . . . . . . . . . . . . . .  .  .",null,null,null,". . . . . . . . . . .",null,null,". . . . . . . . . . .",null,null,". . . . . . . . . . . . . . . . ."]
["Główny księgowy / Skarbnik",null,null,null,"telefon",null,null,"rok m-c dzień",null,null,"Kierownik jednostki (jednostki obsługującej)/ Przewodniczący Zarządu"]
["* Nie dotyczy sprawozdań zbiorczych sporządzanych przez RIO. W przypadku braku głównego księgowego podpisuje tylko kierownik jednostki."]

{"sheet":"73-KRUS","index":11,"n_rows":75,"n_cols":21,"rows_kept":75,"cut":false,"hidden":false,"merged":[[61,9,61,11],[57,9,57,11],[58,9,58,11],[59,9,59,11],[60,9,60,11],[64,0,64,2],[62,9,62,11],[63,9,63,11],[64,9,64,11],[63,0,63,2],[55,9,55,11],[56,9,56,11],[49,12,49,15],[50,9,50,11],[51,9,51,11],[52,9,52,11],[53,9,53,11],[54,9,54,11],[49,9,49,11],[49,3,49,6],[58,0,58,2],[49,0,49,2],[51,0,51,2],[52,0,52,2],[39,0,39,2],[36,0,36,2],[37,0,37,2],[38,0,38,2],[31,0,31,2],[33,0,33,2],[32,0,32,2],[42,9,42,11],[36,9,36,11],[29,9,29,11],[29,12,29,15],[30,9,30,11],[31,9,31,11],[40,0,40,2],[53,0,53,2],[32,9,32,11],[33,9,33,11],[34,9,34,11],[35,9,35,11],[43,9,43,11],[44,9,44,11],[37,9,37,11],[38,9,38,11],[39,9,39,11],[40,9,40,11],[41,9,41,11],[35,0,35,2],[41,0,41,2],[34,0,34,2],[60,0,60,2],[42,0,42,2],[43,0,43,2],[44,0,44,2],[62,0,62,2],[61,0,61,2],[54,0,54,2],[55,0,55,2],[56,0,56,2],[45,0,45,1],[57,0,57,2],[50,0,50,2],[59,0,59,2],[29,0,29,2],[30,0,30,2],[29,3,29,6],[15,5,16,5],[15,6,16,6],[15,3,16,3],[15,4,16,4],[22,0,22,1],[19,0,19,1],[20,0,20,1],[17,0,17,1],[18,0,18,1],[2,0,2,1],[5,0,5,1],[7,0,7,1],[9,2,9,4],[10,2,10,4],[15,7,16,7],[15,8,16,8],[21,0,21,1],[3,13,6,16],[8,2,8,4],[14,0,16,1],[14,2,14,8],[15,2,16,2]]}
[]
["Nazwa jednostki sprawozdawczej ",null,null,null,null,"Rb-UZ  ROCZNE SPRAWOZDANIE UZUPEŁNIAJĄCE O STANIE ZOBOWIĄZAŃ ",null,null,null,null,null,null,null,null,null,null,null,null,null,null,{"$f":"MAXA('20-państw.szk.wyż.:90-agencja wykonawcza'!U1)","v":0}]
[null,null,null,null,null,null,"WG TYTUŁÓW DŁUŻNYCH ",null,null,null,null,null,null,"Adresat:"]
[null,null,null,null,null,null,"KRUS oraz funduszy zarządzanych przez Prezesa KRUS"]
["Adres jednostki sprawozdawczej"]
[]
["Numer identyfikacyjny REGON",null,"liczba identyfik.jedn."]
[null,null,"",null,null,"wg stanu na koniec",null,4,"kwartału","  roku"]
["Nazwa województwa",null,null,null,null,null,null,"SYMBOLE"]
["Nazwa powiatu / związku",null,null,null,null,"WOJ.","POWIAT","GMINA","TYP GM.","ZWIĄZEK JST","TYP ZW.","GRUPA","CZĘŚĆ BUDŻ."]
["Nazwa gminy / związku",null,null,null,null,null,null,null,null,null,null,73]
[]
["A. Struktura walutowa tytułów dłużnych według wartości nominalnej "]
[]
["Wyszczególnienie",null,"W a l u t a"]
[null,null,"Ogółem (kol. 3+4+5+6+7)","PLN","EUR","USD","CHF","Pozostałe waluty wg średniego kursu NBP","Pozostałe waluty wg średniej arytmetycznej"]
[null,null,"Ogółem (kol. 3+4+5+6+7)",null,null,null,null,null,"Pozostałe waluty wg średniej arytmetycznej"]
[1,null,2,3,4,5,6,7,8]
["A. Zobowiązania ogółem (A1+A2+A3+A4)",null,{"$f":"D19+E19+F19+G19+H19","v":0},{"$f":"SUM(D20:D23)","v":0},0,0,0,0,0]
["A1. papiery wartościowe",null,{"$f":"D20+E20+F20+G20+H20","v":0}]
["A2. kredyty i pożyczki",null,{"$f":"D21+E21+F21+G21+H21","v":0}]
["A3. przyjęte depozyty",null,{"$f":"D22+E22+F22+G22+H22","v":0}]
["A4. wymagalne zobowiązania",null,{"$f":"D23+E23+F23+G23+H23","v":0}]
[]
[" B. Struktura terminowa zobowiązań z tytułu zaciagniętych kredytów i pożyczek oraz wyemitowanych papierów wartościowych"]
[]
[" B1. papiery wartościowe wg pierwotnego terminu zapadalności - stan na koniec okresu sprawozdawczego",null,null,null,null,null,null,null,null," B2. papiery wartościowe wg pozostałego terminu zapadalności - stan na koniec okresu sprawozdawczego"]
["      (wg wartości nominalnej)",null,null,null,null,null,null,null,null,"      (wg wartości nominalnej)"]
[]
["papiery wartościowe",null,null,"zapadalność w latach",null,null,null,null,null,"papiery wartościowe",null,null,"zapadalność w latach"]
["wierzyciele",null,null,"łącznie       (kol. 3+4+5)","( 0;1>","( 1;5>","pow. 5",null,null,"wierzyciele",null,null,"łącznie         (kol. 3+4+5)","( 0;1>","( 1;5>","pow. 5"]
[1,null,null,2,3,4,5,null,null,1,null,null,2,3,4,5]
["1. łącznie (w. 2+3+4+5+6+7+8+9+10+11+12+13)",null,null,{"$f":"SUM(D34:D45)","v":0},{"$f":"SUM(E34:E45)","v":0},{"$f":"SUM(F34:F45)","v":0},{"$f":"SUM(G34:G45)","v":0},null,null,"1. łącznie (w. 2+3+4+5+6+7+8+9+10+11+12+13)",null,null,{"$f":"SUM(M34:M45)","v":0},{"$f":"SUM(N34:N45)","v":0},{"$f":"SUM(O34:O45)","v":0},{"$f":"SUM(P34:P45)","v":0}]
["2. grupa I",null,null,{"$f":"E34+F34+G34","v":0},null,null,null,null,null,"2. grupa I",null,null,{"$f":"N34+O34+P34","v":0}]
["3. grupa II",null,null,0,null,null,null,null,null,"3. grupa II",null,null,0]
["4. grupa III",null,null,0,null,null,null,null,null,"4. grupa III",null,null,0]
["5.grupa IV",null,null,0,null,null,null,null,null,"5.grupa IV",null,null,0]
["6. bank centralny",null,null,0,null,null,null,null,null,"6. bank centralny",null,null,0]
["7. banki",null,null,0,null,null,null,null,null,"7. banki",null,null,0]
["8. pozostałe krajowe instytucje finansowe",null,null,0,null,null,null,null,null,"8. pozostałe krajowe instytucje finansowe",null,null,0]
["9. przedsiębiorstwa niefinansowe",null,null,0,null,null,null,null,null,"9. przedsiębiorstwa niefinansowe",null,null,0]
["10. gospodarstwa domowe",null,null,0,null,null,null,null,null,"10. gospodarstwa domowe",null,null,0]
["11. instytucje niekomercyjne działające na rzecz gospodarstw domowych",null,null,0,null,null,null,null,null,"11. instytucje niekomercyjne działające na rzecz gospodarstw domowych",null,null,0]
["12. podmioty nalezące do strefy euro",null,null,0,null,null,null,null,null,"12. podmioty nalezące do strefy euro",null,null,0]
["13. pozostałe podmioty zagraniczne",null,null,0,null,null,null,null,null,"13. pozostałe podmioty zagraniczne",null,null,0]
[]
[" B3. kredyty i pożyczki wg pierwotnego terminu zapadalności - stan na koniec okresu sprawozdawczego",null,null,null,null,null,null,null,null," B4. kredyty i pożyczki wg pozostałego terminu zapadalności - stan na koniec okresu sprawozdawczego"]
["      (wg wartości nominalnej)",null,null,null,null,null,null,null,null,"      (wg wartości nominalnej)"]
[]
["kredyty i pożyczki",null,null,"zapadalność w latach",null,null,null,null,null,"kredyty i pożyczki",null,null,"zapadalność w latach"]
["wierzyciele",null,null,"łącznie       (kol. 3+4+5)","( 0;1>","( 1;5>","pow. 5",null,null,"wierzyciele",null,null,"łącznie         (kol. 3+4+5)","( 0;1>","( 1;5>","pow. 5"]
[1,null,null,2,3,4,5,null,null,1,null,null,2,3,4,5]
["1. łącznie (w. 2+3+4+5+6+7+8+9+10+11+12+13)",null,null,{"$f":"SUM(D54:D65)","v":0},{"$f":"SUM(E54:E65)","v":0},{"$f":"SUM(F54:F65)","v":0},{"$f":"SUM(G54:G65)","v":0},null,null,"1. łącznie (w. 2+3+4+5+6+7+8+9+10+11+12+13)",null,null,{"$f":"SUM(M54:M65)","v":0},{"$f":"SUM(N54:N65)","v":0},{"$f":"SUM(O54:O65)","v":0},{"$f":"SUM(P54:P65)","v":0}]
["2. grupa I",null,null,{"$f":"E54+F54+G54","v":0},null,null,null,null,null,"2. grupa I",null,null,{"$f":"N54+O54+P54","v":0}]
["3. grupa II",null,null,0,null,null,null,null,null,"3. grupa II",null,null,0]
["4. grupa III",null,null,0,null,null,null,null,null,"4. grupa III",null,null,0]
["5.grupa IV",null,null,0,null,null,null,null,null,"5.grupa IV",null,null,0]
["6. bank centralny",null,null,0,null,null,null,null,null,"6. bank centralny",null,null,0]
["7. banki",null,null,0,null,null,null,null,null,"7. banki",null,null,0]
["8. pozostałe krajowe instytucje finansowe",null,null,0,null,null,null,null,null,"8. pozostałe krajowe instytucje finansowe",null,null,0]
["9. przedsiębiorstwa niefinansowe",null,null,0,null,null,null,null,null,"9. przedsiębiorstwa niefinansowe",null,null,0]
["10. gospodarstwa domowe",null,null,0,null,null,null,null,null,"10. gospodarstwa domowe",null,null,0]
["11. instytucje niekomercyjne działające na rzecz gospodarstw domowych",null,null,0,null,null,null,null,null,"11. instytucje niekomercyjne działające na rzecz gospodarstw domowych",null,null,0]
["12. podmioty nalezące do strefy euro",null,null,0,null,null,null,null,null,"12. podmioty nalezące do strefy euro",null,null,0]
["13. pozostałe podmioty zagraniczne",null,null,0,null,null,null,null,null,"13. pozostałe podmioty zagraniczne",null,null,0]
[]
[]
[]
[]
[]
[]
[]
[". . . . . . . . . . . . . . . . . . . . . . . . . . . . .  .  .",null,null,null,". . . . . . . . . . .",null,null,". . . . . . . . . . .",null,null,". . . . . . . . . . . . . . . . ."]
["Główny księgowy / Skarbnik",null,null,null,"telefon",null,null,"rok m-c dzień",null,null,"Kierownik jednostki (jednostki obsługującej)/ Przewodniczący Zarządu"]
["* Nie dotyczy sprawozdań zbiorczych sporządzanych przez RIO. W przypadku braku głównego księgowego podpisuje tylko kierownik jednostki."]

{"sheet":"81-państw.osoba prawna","index":12,"n_rows":75,"n_cols":21,"rows_kept":75,"cut":false,"hidden":false,"merged":[[3,13,6,16],[3,3,3,10],[8,2,8,4],[15,4,16,4],[14,0,16,1],[14,2,14,8],[15,2,16,2],[15,7,16,7],[15,8,16,8],[15,6,16,6],[15,5,16,5],[15,3,16,3],[22,0,22,1],[19,0,19,1],[20,0,20,1],[21,0,21,1],[17,0,17,1],[18,0,18,1],[2,0,2,1],[5,0,5,1],[7,0,7,1],[9,2,9,4],[10,2,10,4],[35,0,35,2],[39,0,39,2],[29,3,29,6],[37,0,37,2],[38,0,38,2],[31,0,31,2],[29,0,29,2],[30,0,30,2],[33,0,33,2],[32,0,32,2],[34,0,34,2],[36,0,36,2],[44,9,44,11],[60,0,60,2],[61,0,61,2],[54,0,54,2],[55,0,55,2],[56,0,56,2],[59,0,59,2],[45,0,45,1],[49,3,49,6],[58,0,58,2],[53,0,53,2],[49,0,49,2],[51,0,51,2],[52,0,52,2],[57,0,57,2],[50,0,50,2],[40,0,40,2],[41,0,41,2],[42,0,42,2],[43,0,43,2],[44,0,44,2],[33,9,33,11],[34,9,34,11],[35,9,35,11],[43,9,43,11],[36,9,36,11],[37,9,37,11],[38,9,38,11],[39,9,39,11],[40,9,40,11],[41,9,41,11],[42,9,42,11],[29,9,29,11],[29,12,29,15],[30,9,30,11],[31,9,31,11],[32,9,32,11],[55,9,55,11],[56,9,56,11],[49,12,49,15],[50,9,50,11],[51,9,51,11],[52,9,52,11],[53,9,53,11],[54,9,54,11],[49,9,49,11],[64,0,64,2],[62,9,62,11],[63,9,63,11],[64,9,64,11],[63,0,63,2],[62,0,62,2],[61,9,61,11],[57,9,57,11],[58,9,58,11],[59,9,59,11],[60,9,60,11]]}
[]
["Nazwa jednostki sprawozdawczej ",null,null,null,null,"Rb-UZ  ROCZNE SPRAWOZDANIE UZUPEŁNIAJĄCE O STANIE ZOBOWIĄZAŃ ",null,null,null,null,null,null,null,null,null,null,null,null,null,null,{"$f":"MAXA('20-państw.szk.wyż.:90-agencja wykonawcza'!U1)","v":0}]
[null,null,null,null,null,null,"WG TYTUŁÓW DŁUŻNYCH ",null,null,null,null,null,null,"Adresat:"]
[null,null,null,"państwowej osoby prawnej utworzonej na podstawie odrębnych ustaw w celu wykonywania zadań publicznych \n(z wyłączeniem agencji wykonawczych)"]
["Adres jednostki sprawozdawczej"]
[]
["Numer identyfikacyjny REGON",null,"liczba identyfik.jedn."]
[null,null,"",null,null,"wg stanu na koniec",null,4,"kwartału","  roku"]
["Nazwa województwa",null,null,null,null,null,null,"SYMBOLE"]
["Nazwa powiatu / związku",null,null,null,null,"WOJ.","POWIAT","GMINA","TYP GM.","ZWIĄZEK JST","TYP ZW.","GRUPA","CZĘŚĆ BUDŻ."]
["Nazwa gminy / związku",null,null,null,null,null,null,null,null,null,null,81]
[]
["A. Struktura walutowa tytułów dłużnych według wartości nominalnej "]
[]
["Wyszczególnienie",null,"W a l u t a"]
[null,null,"Ogółem (kol. 3+4+5+6+7)","PLN","EUR","USD","CHF","Pozostałe waluty wg średniego kursu NBP","Pozostałe waluty wg średniej arytmetycznej"]
[null,null,"Ogółem (kol. 3+4+5+6+7)",null,null,null,null,null,"Pozostałe waluty wg średniej arytmetycznej"]
[1,null,2,3,4,5,6,7,8]
["A. Zobowiązania ogółem (A1+A2+A3+A4)",null,{"$f":"D19+E19+F19+G19+H19","v":0},{"$f":"SUM(D20:D23)","v":0},0,0,0,0,0]
["A1. papiery wartościowe",null,{"$f":"D20+E20+F20+G20+H20","v":0}]
["A2. kredyty i pożyczki",null,{"$f":"D21+E21+F21+G21+H21","v":0}]
["A3. przyjęte depozyty",null,{"$f":"D22+E22+F22+G22+H22","v":0}]
["A4. wymagalne zobowiązania",null,{"$f":"D23+E23+F23+G23+H23","v":0}]
[]
[" B. Struktura terminowa zobowiązań z tytułu zaciagniętych kredytów i pożyczek oraz wyemitowanych papierów wartościowych"]
[]
[" B1. papiery wartościowe wg pierwotnego terminu zapadalności - stan na koniec okresu sprawozdawczego",null,null,null,null,null,null,null,null," B2. papiery wartościowe wg pozostałego terminu zapadalności - stan na koniec okresu sprawozdawczego"]
["      (wg wartości nominalnej)",null,null,null,null,null,null,null,null,"      (wg wartości nominalnej)"]
[]
["papiery wartościowe",null,null,"zapadalność w latach",null,null,null,null,null,"papiery wartościowe",null,null,"zapadalność w latach"]
["wierzyciele",null,null,"łącznie       (kol. 3+4+5)","( 0;1>","( 1;5>","pow. 5",null,null,"wierzyciele",null,null,"łącznie         (kol. 3+4+5)","( 0;1>","( 1;5>","pow. 5"]
[1,null,null,2,3,4,5,null,null,1,null,null,2,3,4,5]
["1. łącznie (w. 2+3+4+5+6+7+8+9+10+11+12+13)",null,null,{"$f":"SUM(D34:D45)","v":0},{"$f":"SUM(E34:E45)","v":0},{"$f":"SUM(F34:F45)","v":0},{"$f":"SUM(G34:G45)","v":0},null,null,"1. łącznie (w. 2+3+4+5+6+7+8+9+10+11+12+13)",null,null,{"$f":"SUM(M34:M45)","v":0},{"$f":"SUM(N34:N45)","v":0},{"$f":"SUM(O34:O45)","v":0},{"$f":"SUM(P34:P45)","v":0}]
["2. grupa I",null,null,{"$f":"E34+F34+G34","v":0},null,null,null,null,null,"2. grupa I",null,null,{"$f":"N34+O34+P34","v":0}]
["3. grupa II",null,null,{"$f":"E35+F35+G35","v":0},null,null,null,null,null,"3. grupa II",null,null,{"$f":"N35+O35+P35","v":0}]
["4. grupa III",null,null,0,null,null,null,null,null,"4. grupa III",null,null,0]
["5.grupa IV",null,null,0,null,null,null,null,null,"5.grupa IV",null,null,0]
["6. bank centralny",null,null,0,null,null,null,null,null,"6. bank centralny",null,null,0]
["7. banki",null,null,0,null,null,null,null,null,"7. banki",null,null,0]
["8. pozostałe krajowe instytucje finansowe",null,null,0,null,null,null,null,null,"8. pozostałe krajowe instytucje finansowe",null,null,0]
["9. przedsiębiorstwa niefinansowe",null,null,0,null,null,null,null,null,"9. przedsiębiorstwa niefinansowe",null,null,0]
["10. gospodarstwa domowe",null,null,0,null,null,null,null,null,"10. gospodarstwa domowe",null,null,0]
["11. instytucje niekomercyjne działające na rzecz gospodarstw domowych",null,null,0,null,null,null,null,null,"11. instytucje niekomercyjne działające na rzecz gospodarstw domowych",null,null,0]
["12. podmioty nalezące do strefy euro",null,null,0,null,null,null,null,null,"12. podmioty nalezące do strefy euro",null,null,0]
["13. pozostałe podmioty zagraniczne",null,null,0,null,null,null,null,null,"13. pozostałe podmioty zagraniczne",null,null,0]
[]
[" B3. kredyty i pożyczki wg pierwotnego terminu zapadalności - stan na koniec okresu sprawozdawczego",null,null,null,null,null,null,null,null," B4. kredyty i pożyczki wg pozostałego terminu zapadalności - stan na koniec okresu sprawozdawczego"]
["      (wg wartości nominalnej)",null,null,null,null,null,null,null,null,"      (wg wartości nominalnej)"]
[]
["kredyty i pożyczki",null,null,"zapadalność w latach",null,null,null,null,null,"kredyty i pożyczki",null,null,"zapadalność w latach"]
["wierzyciele",null,null,"łącznie       (kol. 3+4+5)","( 0;1>","( 1;5>","pow. 5",null,null,"wierzyciele",null,null,"łącznie         (kol. 3+4+5)","( 0;1>","( 1;5>","pow. 5"]
[1,null,null,2,3,4,5,null,null,1,null,null,2,3,4,5]
["1. łącznie (w. 2+3+4+5+6+7+8+9+10+11+12+13)",null,null,{"$f":"SUM(D54:D65)","v":0},{"$f":"SUM(E54:E65)","v":0},{"$f":"SUM(F54:F65)","v":0},{"$f":"SUM(G54:G65)","v":0},null,null,"1. łącznie (w. 2+3+4+5+6+7+8+9+10+11+12+13)",null,null,{"$f":"SUM(M54:M65)","v":0},{"$f":"SUM(N54:N65)","v":0},{"$f":"SUM(O54:O65)","v":0},{"$f":"SUM(P54:P65)","v":0}]
["2. grupa I",null,null,{"$f":"E54+F54+G54","v":0},null,null,null,null,null,"2. grupa I",null,null,{"$f":"N54+O54+P54","v":0}]
["3. grupa II",null,null,{"$f":"E55+F55+G55","v":0},null,null,null,null,null,"3. grupa II",null,null,{"$f":"N55+O55+P55","v":0}]
["4. grupa III",null,null,0,null,null,null,null,null,"4. grupa III",null,null,0]
["5.grupa IV",null,null,0,null,null,null,null,null,"5.grupa IV",null,null,0]
["6. bank centralny",null,null,0,null,null,null,null,null,"6. bank centralny",null,null,0]
["7. banki",null,null,0,null,null,null,null,null,"7. banki",null,null,0]
["8. pozostałe krajowe instytucje finansowe",null,null,0,null,null,null,null,null,"8. pozostałe krajowe instytucje finansowe",null,null,0]
["9. przedsiębiorstwa niefinansowe",null,null,0,null,null,null,null,null,"9. przedsiębiorstwa niefinansowe",null,null,0]
["10. gospodarstwa domowe",null,null,0,null,null,null,null,null,"10. gospodarstwa domowe",null,null,0]
["11. instytucje niekomercyjne działające na rzecz gospodarstw domowych",null,null,0,null,null,null,null,null,"11. instytucje niekomercyjne działające na rzecz gospodarstw domowych",null,null,0]
["12. podmioty nalezące do strefy euro",null,null,0,null,null,null,null,null,"12. podmioty nalezące do strefy euro",null,null,0]
["13. pozostałe podmioty zagraniczne",null,null,0,null,null,null,null,null,"13. pozostałe podmioty zagraniczne",null,null,0]
[]
[]
[]
[]
[]
[]
[]
[". . . . . . . . . . . . . . . . . . . . . . . . . . . . .  .  .",null,null,null,". . . . . . . . . . .",null,null,". . . . . . . . . . .",null,null,". . . . . . . . . . . . . . . . ."]
["Główny księgowy / Skarbnik",null,null,null,"telefon",null,null,"rok m-c dzień",null,null,"Kierownik jednostki (jednostki obsługującej)/ Przewodniczący Zarządu"]
["* Nie dotyczy sprawozdań zbiorczych sporządzanych przez RIO. W przypadku braku głównego księgowego podpisuje tylko kierownik jednostki."]

{"sheet":"82-samorz.osoba prawna","index":13,"n_rows":75,"n_cols":21,"rows_kept":75,"cut":false,"hidden":false,"merged":[[3,13,6,16],[8,2,8,4],[34,0,34,2],[22,0,22,1],[19,0,19,1],[20,0,20,1],[21,0,21,1],[29,9,29,11],[32,9,32,11],[33,9,33,11],[34,9,34,11],[29,12,29,15],[30,9,30,11],[31,9,31,11],[17,0,17,1],[18,0,18,1],[33,0,33,2],[32,0,32,2],[36,0,36,2],[35,0,35,2],[2,0,2,1],[5,0,5,1],[7,0,7,1],[9,2,9,4],[10,2,10,4],[61,0,61,2],[54,0,54,2],[55,0,55,2],[56,0,56,2],[55,9,55,11],[56,9,56,11],[54,9,54,11],[59,0,59,2],[58,0,58,2],[61,9,61,11],[52,0,52,2],[57,0,57,2],[52,9,52,11],[60,0,60,2],[53,9,53,11],[53,0,53,2],[57,9,57,11],[58,9,58,11],[59,9,59,11],[60,9,60,11],[49,12,49,15],[50,9,50,11],[35,9,35,11],[41,9,41,11],[42,9,42,11],[40,9,40,11],[36,9,36,11],[37,9,37,11],[38,9,38,11],[39,9,39,11],[43,9,43,11],[44,9,44,11],[49,9,49,11],[64,0,64,2],[62,9,62,11],[63,9,63,11],[64,9,64,11],[63,0,63,2],[62,0,62,2],[51,9,51,11],[45,0,45,1],[50,0,50,2],[49,0,49,2],[49,3,49,6],[51,0,51,2],[40,0,40,2],[41,0,41,2],[42,0,42,2],[43,0,43,2],[44,0,44,2],[39,0,39,2],[29,3,29,6],[15,5,16,5],[15,6,16,6],[14,0,16,1],[14,2,14,8],[15,2,16,2],[15,3,16,3],[15,4,16,4],[15,7,16,7],[15,8,16,8],[37,0,37,2],[38,0,38,2],[31,0,31,2],[29,0,29,2],[30,0,30,2]]}
[]
["Nazwa jednostki sprawozdawczej ",null,null,null,null,"Rb-UZ  ROCZNE SPRAWOZDANIE UZUPEŁNIAJĄCE O STANIE ZOBOWIĄZAŃ ",null,null,null,null,null,null,null,null,null,null,null,null,null,null,{"$f":"MAXA('20-państw.szk.wyż.:90-agencja wykonawcza'!U1)","v":0}]
[null,null,null,null,null,null,"WG TYTUŁÓW DŁUŻNYCH ",null,null,null,null,null,null,"Adresat:"]
[null,null,null,"samorządowej osoby prawnej utworzonej na podstawie odrębnych ustaw w celu wykonywania zadań publicznych"]
["Adres jednostki sprawozdawczej"]
[]
["Numer identyfikacyjny REGON",null,"liczba identyfik.jedn."]
[null,null,"",null,null,"wg stanu na koniec",null,4,"kwartału","  roku"]
["Nazwa województwa",null,null,null,null,null,null,"SYMBOLE"]
["Nazwa powiatu / związku",null,null,null,null,"WOJ.","POWIAT","GMINA","TYP GM.","ZWIĄZEK JST","TYP ZW.","GRUPA","CZĘŚĆ BUDŻ."]
["Nazwa gminy / związku",null,null,null,null,null,null,null,null,null,null,82]
[]
["A. Struktura walutowa tytułów dłużnych według wartości nominalnej "]
[]
["Wyszczególnienie",null,"W a l u t a"]
[null,null,"Ogółem (kol. 3+4+5+6+7)","PLN","EUR","USD","CHF","Pozostałe waluty wg średniego kursu NBP","Pozostałe waluty wg średniej arytmetycznej"]
[null,null,"Ogółem (kol. 3+4+5+6+7)",null,null,null,null,null,"Pozostałe waluty wg średniej arytmetycznej"]
[1,null,2,3,4,5,6,7,8]
["A. Zobowiązania ogółem (A1+A2+A3+A4)",null,{"$f":"D19+E19+F19+G19+H19","v":0},{"$f":"SUM(D20:D23)","v":0},0,0,0,0,0]
["A1. papiery wartościowe",null,{"$f":"D20+E20+F20+G20+H20","v":0}]
["A2. kredyty i pożyczki",null,{"$f":"D21+E21+F21+G21+H21","v":0}]
["A3. przyjęte depozyty",null,{"$f":"D22+E22+F22+G22+H22","v":0}]
["A4. wymagalne zobowiązania",null,{"$f":"D23+E23+F23+G23+H23","v":0}]
[]
[" B. Struktura terminowa zobowiązań z tytułu zaciagniętych kredytów i pożyczek oraz wyemitowanych papierów wartościowych"]
[]
[" B1. papiery wartościowe wg pierwotnego terminu zapadalności - stan na koniec okresu sprawozdawczego",null,null,null,null,null,null,null,null," B2. papiery wartościowe wg pozostałego terminu zapadalności - stan na koniec okresu sprawozdawczego"]
["      (wg wartości nominalnej)",null,null,null,null,null,null,null,null,"      (wg wartości nominalnej)"]
[]
["papiery wartościowe",null,null,"zapadalność w latach",null,null,null,null,null,"papiery wartościowe",null,null,"zapadalność w latach"]
["wierzyciele",null,null,"łącznie       (kol. 3+4+5)","( 0;1>","( 1;5>","pow. 5",null,null,"wierzyciele",null,null,"łącznie         (kol. 3+4+5)","( 0;1>","( 1;5>","pow. 5"]
[1,null,null,2,3,4,5,null,null,1,null,null,2,3,4,5]
["1. łącznie (w. 2+3+4+5+6+7+8+9+10+11+12+13)",null,null,{"$f":"SUM(D34:D45)","v":0},{"$f":"SUM(E34:E45)","v":0},{"$f":"SUM(F34:F45)","v":0},{"$f":"SUM(G34:G45)","v":0},null,null,"1. łącznie (w. 2+3+4+5+6+7+8+9+10+11+12+13)",null,null,{"$f":"SUM(M34:M45)","v":0},{"$f":"SUM(N34:N45)","v":0},{"$f":"SUM(O34:O45)","v":0},{"$f":"SUM(P34:P45)","v":0}]
["2. grupa I",null,null,{"$f":"E34+F34+G34","v":0},null,null,null,null,null,"2. grupa I",null,null,{"$f":"N34+O34+P34","v":0}]
["3. grupa II",null,null,{"$f":"E35+F35+G35","v":0},null,null,null,null,null,"3. grupa II",null,null,{"$f":"N35+O35+P35","v":0}]
["4. grupa III",null,null,0,null,null,null,null,null,"4. grupa III",null,null,0]
["5.grupa IV",null,null,0,null,null,null,null,null,"5.grupa IV",null,null,0]
["6. bank centralny",null,null,0,null,null,null,null,null,"6. bank centralny",null,null,0]
["7. banki",null,null,0,null,null,null,null,null,"7. banki",null,null,0]
["8. pozostałe krajowe instytucje finansowe",null,null,0,null,null,null,null,null,"8. pozostałe krajowe instytucje finansowe",null,null,0]
["9. przedsiębiorstwa niefinansowe",null,null,0,null,null,null,null,null,"9. przedsiębiorstwa niefinansowe",null,null,0]
["10. gospodarstwa domowe",null,null,0,null,null,null,null,null,"10. gospodarstwa domowe",null,null,0]
["11. instytucje niekomercyjne działające na rzecz gospodarstw domowych",null,null,0,null,null,null,null,null,"11. instytucje niekomercyjne działające na rzecz gospodarstw domowych",null,null,0]
["12. podmioty nalezące do strefy euro",null,null,0,null,null,null,null,null,"12. podmioty nalezące do strefy euro",null,null,0]
["13. pozostałe podmioty zagraniczne",null,null,0,null,null,null,null,null,"13. pozostałe podmioty zagraniczne",null,null,0]
[]
[" B3. kredyty i pożyczki wg pierwotnego terminu zapadalności - stan na koniec okresu sprawozdawczego",null,null,null,null,null,null,null,null," B4. kredyty i pożyczki wg pozostałego terminu zapadalności - stan na koniec okresu sprawozdawczego"]
["      (wg wartości nominalnej)",null,null,null,null,null,null,null,null,"      (wg wartości nominalnej)"]
[]
["kredyty i pożyczki",null,null,"zapadalność w latach",null,null,null,null,null,"kredyty i pożyczki",null,null,"zapadalność w latach"]
["wierzyciele",null,null,"łącznie       (kol. 3+4+5)","( 0;1>","( 1;5>","pow. 5",null,null,"wierzyciele",null,null,"łącznie         (kol. 3+4+5)","( 0;1>","( 1;5>","pow. 5"]
[1,null,null,2,3,4,5,null,null,1,null,null,2,3,4,5]
["1. łącznie (w. 2+3+4+5+6+7+8+9+10+11+12+13)",null,null,{"$f":"SUM(D54:D65)","v":0},{"$f":"SUM(E54:E65)","v":0},{"$f":"SUM(F54:F65)","v":0},{"$f":"SUM(G54:G65)","v":0},null,null,"1. łącznie (w. 2+3+4+5+6+7+8+9+10+11+12+13)",null,null,{"$f":"SUM(M54:M65)","v":0},{"$f":"SUM(N54:N65)","v":0},{"$f":"SUM(O54:O65)","v":0},{"$f":"SUM(P54:P65)","v":0}]
["2. grupa I",null,null,{"$f":"E54+F54+G54","v":0},null,null,null,null,null,"2. grupa I",null,null,{"$f":"N54+O54+P54","v":0}]
["3. grupa II",null,null,{"$f":"E55+F55+G55","v":0},null,null,null,null,null,"3. grupa II",null,null,{"$f":"N55+O55+P55","v":0}]
["4. grupa III",null,null,0,null,null,null,null,null,"4. grupa III",null,null,0]
["5.grupa IV",null,null,0,null,null,null,null,null,"5.grupa IV",null,null,0]
["6. bank centralny",null,null,0,null,null,null,null,null,"6. bank centralny",null,null,0]
["7. banki",null,null,0,null,null,null,null,null,"7. banki",null,null,0]
["8. pozostałe krajowe instytucje finansowe",null,null,0,null,null,null,null,null,"8. pozostałe krajowe instytucje finansowe",null,null,0]
["9. przedsiębiorstwa niefinansowe",null,null,0,null,null,null,null,null,"9. przedsiębiorstwa niefinansowe",null,null,0]
["10. gospodarstwa domowe",null,null,0,null,null,null,null,null,"10. gospodarstwa domowe",null,null,0]
["11. instytucje niekomercyjne działające na rzecz gospodarstw domowych",null,null,0,null,null,null,null,null,"11. instytucje niekomercyjne działające na rzecz gospodarstw domowych",null,null,0]
["12. podmioty nalezące do strefy euro",null,null,0,null,null,null,null,null,"12. podmioty nalezące do strefy euro",null,null,0]
["13. pozostałe podmioty zagraniczne",null,null,0,null,null,null,null,null,"13. pozostałe podmioty zagraniczne",null,null,0]
[]
[]
[]
[]
[]
[]
[]
[". . . . . . . . . . . . . . . . . . . . . . . . . . . . .  .  .",null,null,null,". . . . . . . . . . .",null,null,". . . . . . . . . . .",null,null,". . . . . . . . . . . . . . . . ."]
["Główny księgowy / Skarbnik",null,null,null,"telefon",null,null,"rok m-c dzień",null,null,"Kierownik jednostki (jednostki obsługującej)/ Przewodniczący Zarządu"]
["* Nie dotyczy sprawozdań zbiorczych sporządzanych przez RIO. W przypadku braku głównego księgowego podpisuje tylko kierownik jednostki."]

{"sheet":"90-agencja wykonawcza","index":14,"n_rows":75,"n_cols":21,"rows_kept":75,"cut":false,"hidden":false,"merged":[[3,13,6,16],[3,5,3,8],[8,2,8,4],[15,4,16,4],[14,0,16,1],[14,2,14,8],[15,2,16,2],[15,7,16,7],[15,8,16,8],[15,6,16,6],[15,5,16,5],[15,3,16,3],[22,0,22,1],[19,0,19,1],[20,0,20,1],[21,0,21,1],[17,0,17,1],[18,0,18,1],[2,0,2,1],[5,0,5,1],[7,0,7,1],[9,2,9,4],[10,2,10,4],[35,0,35,2],[39,0,39,2],[29,3,29,6],[37,0,37,2],[38,0,38,2],[31,0,31,2],[29,0,29,2],[30,0,30,2],[33,0,33,2],[32,0,32,2],[34,0,34,2],[36,0,36,2],[44,9,44,11],[60,0,60,2],[61,0,61,2],[54,0,54,2],[55,0,55,2],[56,0,56,2],[59,0,59,2],[45,0,45,1],[49,3,49,6],[58,0,58,2],[53,0,53,2],[49,0,49,2],[51,0,51,2],[52,0,52,2],[57,0,57,2],[50,0,50,2],[40,0,40,2],[41,0,41,2],[42,0,42,2],[43,0,43,2],[44,0,44,2],[33,9,33,11],[34,9,34,11],[35,9,35,11],[43,9,43,11],[36,9,36,11],[37,9,37,11],[38,9,38,11],[39,9,39,11],[40,9,40,11],[41,9,41,11],[42,9,42,11],[29,9,29,11],[29,12,29,15],[30,9,30,11],[31,9,31,11],[32,9,32,11],[55,9,55,11],[56,9,56,11],[49,12,49,15],[50,9,50,11],[51,9,51,11],[52,9,52,11],[53,9,53,11],[54,9,54,11],[49,9,49,11],[64,0,64,2],[62,9,62,11],[63,9,63,11],[64,9,64,11],[63,0,63,2],[62,0,62,2],[61,9,61,11],[57,9,57,11],[58,9,58,11],[59,9,59,11],[60,9,60,11]]}
[]
["Nazwa jednostki sprawozdawczej ",null,null,null,null,"Rb-UZ  ROCZNE SPRAWOZDANIE UZUPEŁNIAJĄCE O STANIE ZOBOWIĄZAŃ ",null,null,null,null,null,null,null,null,null,null,null,null,null,null,{"$f":"MAXA('20-państw.szk.wyż.:90-agencja wykonawcza'!U1)","v":0}]
[null,null,null,null,null,null,"WG TYTUŁÓW DŁUŻNYCH ",null,null,null,null,null,null,"Adresat:"]
[null,null,null,null,null,"agencji wykonawczej"]
["Adres jednostki sprawozdawczej"]
[]
["Numer identyfikacyjny REGON",null,"liczba identyfik.jedn."]
[null,null,"",null,null,"wg stanu na koniec",null,4,"kwartału","  roku"]
["Nazwa województwa",null,null,null,null,null,null,"SYMBOLE"]
["Nazwa powiatu / związku",null,null,null,null,"WOJ.","POWIAT","GMINA","TYP GM.","ZWIĄZEK JST","TYP ZW.","GRUPA","CZĘŚĆ BUDŻ."]
["Nazwa gminy / związku",null,null,null,null,null,null,null,null,null,null,90]
[]
["A. Struktura walutowa tytułów dłużnych według wartości nominalnej "]
[]
["Wyszczególnienie",null,"W a l u t a"]
[null,null,"Ogółem (kol. 3+4+5+6+7)","PLN","EUR","USD","CHF","Pozostałe waluty wg średniego kursu NBP","Pozostałe waluty wg średniej arytmetycznej"]
[null,null,"Ogółem (kol. 3+4+5+6+7)",null,null,null,null,null,"Pozostałe waluty wg średniej arytmetycznej"]
[1,null,2,3,4,5,6,7,8]
["A. Zobowiązania ogółem (A1+A2+A3+A4)",null,{"$f":"D19+E19+F19+G19+H19","v":0},{"$f":"SUM(D20:D23)","v":0},0,0,0,0,0]
["A1. papiery wartościowe",null,{"$f":"D20+E20+F20+G20+H20","v":0}]
["A2. kredyty i pożyczki",null,{"$f":"D21+E21+F21+G21+H21","v":0}]
["A3. przyjęte depozyty",null,{"$f":"D22+E22+F22+G22+H22","v":0}]
["A4. wymagalne zobowiązania",null,{"$f":"D23+E23+F23+G23+H23","v":0}]
[]
[" B. Struktura terminowa zobowiązań z tytułu zaciagniętych kredytów i pożyczek oraz wyemitowanych papierów wartościowych"]
[]
[" B1. papiery wartościowe wg pierwotnego terminu zapadalności - stan na koniec okresu sprawozdawczego",null,null,null,null,null,null,null,null," B2. papiery wartościowe wg pozostałego terminu zapadalności - stan na koniec okresu sprawozdawczego"]
["      (wg wartości nominalnej)",null,null,null,null,null,null,null,null,"      (wg wartości nominalnej)"]
[]
["papiery wartościowe",null,null,"zapadalność w latach",null,null,null,null,null,"papiery wartościowe",null,null,"zapadalność w latach"]
["wierzyciele",null,null,"łącznie       (kol. 3+4+5)","( 0;1>","( 1;5>","pow. 5",null,null,"wierzyciele",null,null,"łącznie         (kol. 3+4+5)","( 0;1>","( 1;5>","pow. 5"]
[1,null,null,2,3,4,5,null,null,1,null,null,2,3,4,5]
["1. łącznie (w. 2+3+4+5+6+7+8+9+10+11+12+13)",null,null,{"$f":"SUM(D34:D45)","v":0},{"$f":"SUM(E34:E45)","v":0},{"$f":"SUM(F34:F45)","v":0},{"$f":"SUM(G34:G45)","v":0},null,null,"1. łącznie (w. 2+3+4+5+6+7+8+9+10+11+12+13)",null,null,{"$f":"SUM(M34:M45)","v":0},{"$f":"SUM(N34:N45)","v":0},{"$f":"SUM(O34:O45)","v":0},{"$f":"SUM(P34:P45)","v":0}]
["2. grupa I",null,null,{"$f":"E34+F34+G34","v":0},null,null,null,null,null,"2. grupa I",null,null,{"$f":"N34+O34+P34","v":0}]
["3. grupa II",null,null,{"$f":"E35+F35+G35","v":0},null,null,null,null,null,"3. grupa II",null,null,{"$f":"N35+O35+P35","v":0}]
["4. grupa III",null,null,0,null,null,null,null,null,"4. grupa III",null,null,0]
["5.grupa IV",null,null,0,null,null,null,null,null,"5.grupa IV",null,null,0]
["6. bank centralny",null,null,0,null,null,null,null,null,"6. bank centralny",null,null,0]
["7. banki",null,null,0,null,null,null,null,null,"7. banki",null,null,0]
["8. pozostałe krajowe instytucje finansowe",null,null,0,null,null,null,null,null,"8. pozostałe krajowe instytucje finansowe",null,null,0]
["9. przedsiębiorstwa niefinansowe",null,null,0,null,null,null,null,null,"9. przedsiębiorstwa niefinansowe",null,null,0]
["10. gospodarstwa domowe",null,null,0,null,null,null,null,null,"10. gospodarstwa domowe",null,null,0]
["11. instytucje niekomercyjne działające na rzecz gospodarstw domowych",null,null,0,null,null,null,null,null,"11. instytucje niekomercyjne działające na rzecz gospodarstw domowych",null,null,0]
["12. podmioty nalezące do strefy euro",null,null,0,null,null,null,null,null,"12. podmioty nalezące do strefy euro",null,null,0]
["13. pozostałe podmioty zagraniczne",null,null,0,null,null,null,null,null,"13. pozostałe podmioty zagraniczne",null,null,0]
[]
[" B3. kredyty i pożyczki wg pierwotnego terminu zapadalności - stan na koniec okresu sprawozdawczego",null,null,null,null,null,null,null,null," B4. kredyty i pożyczki wg pozostałego terminu zapadalności - stan na koniec okresu sprawozdawczego"]
["      (wg wartości nominalnej)",null,null,null,null,null,null,null,null,"      (wg wartości nominalnej)"]
[]
["kredyty i pożyczki",null,null,"zapadalność w latach",null,null,null,null,null,"kredyty i pożyczki",null,null,"zapadalność w latach"]
["wierzyciele",null,null,"łącznie       (kol. 3+4+5)","( 0;1>","( 1;5>","pow. 5",null,null,"wierzyciele",null,null,"łącznie         (kol. 3+4+5)","( 0;1>","( 1;5>","pow. 5"]
[1,null,null,2,3,4,5,null,null,1,null,null,2,3,4,5]
["1. łącznie (w. 2+3+4+5+6+7+8+9+10+11+12+13)",null,null,{"$f":"SUM(D54:D65)","v":0},{"$f":"SUM(E54:E65)","v":0},{"$f":"SUM(F54:F65)","v":0},{"$f":"SUM(G54:G65)","v":0},null,null,"1. łącznie (w. 2+3+4+5+6+7+8+9+10+11+12+13)",null,null,{"$f":"SUM(M54:M65)","v":0},{"$f":"SUM(N54:N65)","v":0},{"$f":"SUM(O54:O65)","v":0},{"$f":"SUM(P54:P65)","v":0}]
["2. grupa I",null,null,{"$f":"E54+F54+G54","v":0},null,null,null,null,null,"2. grupa I",null,null,{"$f":"N54+O54+P54","v":0}]
["3. grupa II",null,null,{"$f":"E55+F55+G55","v":0},null,null,null,null,null,"3. grupa II",null,null,{"$f":"N55+O55+P55","v":0}]
["4. grupa III",null,null,0,null,null,null,null,null,"4. grupa III",null,null,0]
["5.grupa IV",null,null,0,null,null,null,null,null,"5.grupa IV",null,null,0]
["6. bank centralny",null,null,0,null,null,null,null,null,"6. bank centralny",null,null,0]
["7. banki",null,null,0,null,null,null,null,null,"7. banki",null,null,0]
["8. pozostałe krajowe instytucje finansowe",null,null,0,null,null,null,null,null,"8. pozostałe krajowe instytucje finansowe",null,null,0]
["9. przedsiębiorstwa niefinansowe",null,null,0,null,null,null,null,null,"9. przedsiębiorstwa niefinansowe",null,null,0]
["10. gospodarstwa domowe",null,null,0,null,null,null,null,null,"10. gospodarstwa domowe",null,null,0]
["11. instytucje niekomercyjne działające na rzecz gospodarstw domowych",null,null,0,null,null,null,null,null,"11. instytucje niekomercyjne działające na rzecz gospodarstw domowych",null,null,0]
["12. podmioty nalezące do strefy euro",null,null,0,null,null,null,null,null,"12. podmioty nalezące do strefy euro",null,null,0]
["13. pozostałe podmioty zagraniczne",null,null,0,null,null,null,null,null,"13. pozostałe podmioty zagraniczne",null,null,0]
[]
[]
[]
[]
[]
[]
[]
[". . . . . . . . . . . . . . . . . . . . . . . . . . . . .  .  .",null,null,null,". . . . . . . . . . .",null,null,". . . . . . . . . . .",null,null,". . . . . . . . . . . . . . . . ."]
["Główny księgowy / Skarbnik",null,null,null,"telefon",null,null,"rok m-c dzień",null,null,"Kierownik jednostki (jednostki obsługującej)/ Przewodniczący Zarządu"]
["* Nie dotyczy sprawozdań zbiorczych sporządzanych przez RIO. W przypadku braku głównego księgowego podpisuje tylko kierownik jednostki."]

{"sheet":"99-zbiorczo","index":15,"n_rows":138,"n_cols":22,"rows_kept":138,"cut":false,"hidden":false,"merged":[[9,2,9,4],[10,2,10,4],[3,13,6,16],[8,2,8,4],[2,0,3,1],[5,0,5,1],[7,0,7,1],[29,9,29,11],[29,12,29,15],[14,0,16,1],[14,2,14,8],[15,8,16,8],[15,5,16,5],[15,6,16,6],[15,7,16,7],[22,0,22,1],[19,0,19,1],[20,0,20,1],[17,0,17,1],[18,0,18,1],[15,2,16,2],[15,3,16,3],[15,4,16,4],[21,0,21,1],[37,0,37,2],[38,0,38,2],[31,0,31,2],[29,0,29,2],[30,0,30,2],[33,0,33,2],[32,0,32,2],[34,0,34,2],[29,3,29,6],[41,0,41,2],[42,0,42,2],[43,0,43,2],[44,0,44,2],[36,0,36,2],[40,0,40,2],[35,0,35,2],[39,0,39,2],[50,0,50,2],[54,0,54,2],[55,0,55,2],[56,0,56,2],[53,0,53,2],[52,0,52,2],[45,0,45,1],[49,3,49,6],[58,0,58,2],[59,0,59,2],[32,9,32,11],[33,9,33,11],[34,9,34,11],[35,9,35,11],[43,9,43,11],[44,9,44,11],[49,9,49,11],[52,9,52,11],[55,9,55,11],[56,9,56,11],[49,0,49,2],[51,0,51,2],[30,9,30,11],[31,9,31,11],[49,12,49,15],[50,9,50,11],[51,9,51,11],[36,9,36,11],[37,9,37,11],[38,9,38,11],[39,9,39,11],[40,9,40,11],[41,9,41,11],[42,9,42,11],[64,0,64,2],[62,9,62,11],[63,9,63,11],[64,9,64,11],[63,0,63,2],[62,0,62,2],[60,0,60,2],[61,0,61,2],[53,9,53,11],[54,9,54,11],[61,9,61,11],[57,9,57,11],[58,9,58,11],[59,9,59,11],[60,9,60,11],[57,0,57,2]]}
[null,null,null,null,null,null,null,null,null,null,null,null,null,null,null,null,null,null,null,null,0]
["Nazwa jednostki sprawozdawczej ",null,null,null,null,"Rb-UZ  ROCZNE SPRAWOZDANIE UZUPEŁNIAJĄCE O STANIE ZOBOWIĄZAŃ ",null,null,null,null,null,null,null,null,null,null,null,null,null,null,{"$f":"MAX('11-państw.fund.cel.:90-agencja wykonawcza'!U1)","v":0},"regon"]
[{"$f":"IF(B137=\"brak nazwy\",IF(B138=\"brak nazwy\",\"Brak nazwy\",B138),B137)","v":"Brak nazwy"},null,null,null,null,null,"WG TYTUŁÓW DŁUŻNYCH ",null,null,null,null,null,null,"Adresat:",null,null,null,null,null,null,{"$f":"COUNTA('11-państw.fund.cel.:90-agencja wykonawcza'!H8)","v":15},"kwartal"]
[null,null,null,null,null,null,null,null,null,null,null,null,null,null,null,null,null,null,null,{"$f":"MIN('11-państw.fund.cel.:90-agencja wykonawcza'!H8)","v":4},{"$f":"MAX('11-państw.fund.cel.:90-agencja wykonawcza'!H8)","v":4}]
["Adres jednostki sprawozdawczej",null,null,null,null,null,null,null,null,null,null,null,null,null,null,null,null,null,null,null,{"$f":"COUNTA('11-państw.fund.cel.:90-agencja wykonawcza'!K8)","v":0},"rok"]
[null,null,null,null,null,null,null,null,null,null,null,null,null,null,null,null,null,null,null,{"$f":"MIN('11-państw.fund.cel.:90-agencja wykonawcza'!K8)","v":0},{"$f":"MAX('11-państw.fund.cel.:90-agencja wykonawcza'!K8)","v":0}]
["Numer identyfikacyjny REGON",null,"liczba identyfik.jedn.",null,null,null,null,null,null,null,null,null,null,null,null,null,null,null,null,null,{"$f":"COUNTA('11-państw.fund.cel.:90-agencja wykonawcza'!C8)","v":15}]
[{"$f":"IF(B116=\"brak regonu\",IF(B117=\"brak regonu\",\"Brak nr REGON\",B117),B116)","v":"Brak nr REGON"},null,{"$f":"IF(U7<>0,IF(U8=T8,U8,\"\"),\"\")","v":0},null,null,"wg stanu na koniec",null,4,"kwartału","  roku",{"$f":"IF(U5=0,\"Brak roku\",U6)","v":"Brak roku"},null,null,null,null,null,null,null,null,{"$f":"MIN('11-państw.fund.cel.:90-agencja wykonawcza'!C8)","v":0},{"$f":"MAX('11-państw.fund.cel.:90-agencja wykonawcza'!C8)","v":0},"licz.ident.jedn."]
["Nazwa województwa",null,null,null,null,null,null,"SYMBOLE"]
["Nazwa powiatu / związku",null,null,null,null,"WOJ.","POWIAT","GMINA","TYP GM.","ZWIĄZEK JST","TYP ZW.","GRUPA","CZĘŚĆ BUDŻ.",null,null,null,null,null,null,{"$f":"MIN('11-państw.fund.cel.:90-agencja wykonawcza'!U10)","v":0},{"$f":"MAX('11-państw.fund.cel.:90-agencja wykonawcza'!U10)","v":0}]
["Nazwa gminy / związku",null,null,null,null,null,null,null,null,null,null,99]
[null,null,null,null,null,null,null,null,null,null,null,null,null,null,null,null,null,null,null,{"$f":"MIN('11-państw.fund.cel.:90-agencja wykonawcza'!M11)","v":0},{"$f":"MAX('11-państw.fund.cel.:90-agencja wykonawcza'!M11)","v":0}]
["A. Struktura walutowa tytułów dłużnych według wartości nominalnej "]
[]
["Wyszczególnienie",null,"W a l u t a"]
[null,null,"Ogółem (kol. 3+4+5+6+7)","PLN","EUR","USD","CHF","Pozostałe waluty wg średniego kursu NBP","Pozostałe waluty wg średniej arytmetycznej"]
[null,null,"Ogółem (kol. 3+4+5+6+7)",null,null,null,null,null,"Pozostałe waluty wg średniej arytmetycznej"]
[1,null,2,3,4,5,6,7,8]
["A. Zobowiązania ogółem (A1+A2+A3+A4)",null,{"$f":"SUM('11-państw.fund.cel.:90-agencja wykonawcza'!C19)","v":0},{"$f":"SUM('11-państw.fund.cel.:90-agencja wykonawcza'!D19)","v":0},{"$f":"SUM('11-państw.fund.cel.:90-agencja wykonawcza'!E19)","v":0},{"$f":"SUM('11-państw.fund.cel.:90-agencja wykonawcza'!F19)","v":0},{"$f":"SUM('11-państw.fund.cel.:90-agencja wykonawcza'!G19)","v":0},{"$f":"SUM('11-państw.fund.cel.:90-agencja wykonawcza'!H19)","v":0},{"$f":"SUM('11-państw.fund.cel.:90-agencja wykonawcza'!I19)","v":0}]
["A1. papiery wartościowe",null,{"$f":"SUM('11-państw.fund.cel.:90-agencja wykonawcza'!C20)","v":0},{"$f":"SUM('11-państw.fund.cel.:90-agencja wykonawcza'!D20)","v":0},{"$f":"SUM('11-państw.fund.cel.:90-agencja wykonawcza'!E20)","v":0},{"$f":"SUM('11-państw.fund.cel.:90-agencja wykonawcza'!F20)","v":0},{"$f":"SUM('11-państw.fund.cel.:90-agencja wykonawcza'!G20)","v":0},{"$f":"SUM('11-państw.fund.cel.:90-agencja wykonawcza'!H20)","v":0},{"$f":"SUM('11-państw.fund.cel.:90-agencja wykonawcza'!I20)","v":0}]
["A2. kredyty i pożyczki",null,{"$f":"SUM('11-państw.fund.cel.:90-agencja wykonawcza'!C21)","v":0},{"$f":"SUM('11-państw.fund.cel.:90-agencja wykonawcza'!D21)","v":0},{"$f":"SUM('11-państw.fund.cel.:90-agencja wykonawcza'!E21)","v":0},{"$f":"SUM('11-państw.fund.cel.:90-agencja wykonawcza'!F21)","v":0},{"$f":"SUM('11-państw.fund.cel.:90-agencja wykonawcza'!G21)","v":0},{"$f":"SUM('11-państw.fund.cel.:90-agencja wykonawcza'!H21)","v":0},{"$f":"SUM('11-państw.fund.cel.:90-agencja wykonawcza'!I21)","v":0}]
["A3. przyjęte depozyty",null,{"$f":"SUM('11-państw.fund.cel.:90-agencja wykonawcza'!C22)","v":0},{"$f":"SUM('11-państw.fund.cel.:90-agencja wykonawcza'!D22)","v":0},{"$f":"SUM('11-państw.fund.cel.:90-agencja wykonawcza'!E22)","v":0},{"$f":"SUM('11-państw.fund.cel.:90-agencja wykonawcza'!F22)","v":0},{"$f":"SUM('11-państw.fund.cel.:90-agencja wykonawcza'!G22)","v":0},{"$f":"SUM('11-państw.fund.cel.:90-agencja wykonawcza'!H22)","v":0},{"$f":"SUM('11-państw.fund.cel.:90-agencja wykonawcza'!I22)","v":0}]
["A4. wymagalne zobowiązania",null,{"$f":"SUM('11-państw.fund.cel.:90-agencja wykonawcza'!C23)","v":0},{"$f":"SUM('11-państw.fund.cel.:90-agencja wykonawcza'!D23)","v":0},{"$f":"SUM('11-państw.fund.cel.:90-agencja wykonawcza'!E23)","v":0},{"$f":"SUM('11-państw.fund.cel.:90-agencja wykonawcza'!F23)","v":0},{"$f":"SUM('11-państw.fund.cel.:90-agencja wykonawcza'!G23)","v":0},{"$f":"SUM('11-państw.fund.cel.:90-agencja wykonawcza'!H23)","v":0},{"$f":"SUM('11-państw.fund.cel.:90-agencja wykonawcza'!I23)","v":0}]
[]
[" B. Struktura terminowa zobowiązań z tytułu zaciagniętych kredytów i pożyczek oraz wyemitowanych papierów wartościowych"]
[]
[" B1. papiery wartościowe wg pierwotnego terminu zapadalności - stan na koniec okresu sprawozdawczego",null,null,null,null,null,null,null,null," B2. papiery wartościowe wg pozostałego terminu zapadalności - stan na koniec okresu sprawozdawczego"]
["      (wg wartości nominalnej)",null,null,null,null,null,null,null,null,"      (wg wartości nominalnej)"]
[]
["papiery wartościowe",null,null,"zapadalność w latach",null,null,null,null,null,"papiery wartościowe",null,null,"zapadalność w latach"]
["wierzyciele",null,null,"łącznie       (kol. 3+4+5)","( 0;1>","( 1;5>","pow. 5",null,null,"wierzyciele",null,null,"łącznie         (kol. 3+4+5)","( 0;1>","( 1;5>","pow. 5"]
[1,null,null,2,3,4,5,null,null,1,null,null,2,3,4,5]
["1. łącznie (w. 2+3+4+5+6+7+8+9+10+11+12+13)",null,null,{"$f":"SUM('11-państw.fund.cel.:90-agencja wykonawcza'!D33)","v":0},{"$f":"SUM('11-państw.fund.cel.:90-agencja wykonawcza'!E33)","v":0},{"$f":"SUM('11-państw.fund.cel.:90-agencja wykonawcza'!F33)","v":0},{"$f":"SUM('11-państw.fund.cel.:90-agencja wykonawcza'!G33)","v":0},null,null,"1. łącznie (w. 2+3+4+5+6+7+8+9+10+11+12+13)",null,null,{"$f":"SUM('11-państw.fund.cel.:90-agencja wykonawcza'!M33)","v":0},{"$f":"SUM('11-państw.fund.cel.:90-agencja wykonawcza'!N33)","v":0},{"$f":"SUM('11-państw.fund.cel.:90-agencja wykonawcza'!O33)","v":0},{"$f":"SUM('11-państw.fund.cel.:90-agencja wykonawcza'!P33)","v":0}]
["2. grupa I",null,null,{"$f":"SUM('11-państw.fund.cel.:90-agencja wykonawcza'!D34)","v":0},{"$f":"SUM('11-państw.fund.cel.:90-agencja wykonawcza'!E34)","v":0},{"$f":"SUM('11-państw.fund.cel.:90-agencja wykonawcza'!F34)","v":0},{"$f":"SUM('11-państw.fund.cel.:90-agencja wykonawcza'!G34)","v":0},null,null,"2. grupa I",null,null,{"$f":"SUM('11-państw.fund.cel.:90-agencja wykonawcza'!M34)","v":0},{"$f":"SUM('11-państw.fund.cel.:90-agencja wykonawcza'!N34)","v":0},{"$f":"SUM('11-państw.fund.cel.:90-agencja wykonawcza'!O34)","v":0},{"$f":"SUM('11-państw.fund.cel.:90-agencja wykonawcza'!P34)","v":0}]
["3. grupa II",null,null,{"$f":"SUM('11-państw.fund.cel.:90-agencja wykonawcza'!D35)","v":0},{"$f":"SUM('11-państw.fund.cel.:90-agencja wykonawcza'!E35)","v":0},{"$f":"SUM('11-państw.fund.cel.:90-agencja wykonawcza'!F35)","v":0},{"$f":"SUM('11-państw.fund.cel.:90-agencja wykonawcza'!G35)","v":0},null,null,"3. grupa II",null,null,{"$f":"SUM('11-państw.fund.cel.:90-agencja wykonawcza'!M35)","v":0},{"$f":"SUM('11-państw.fund.cel.:90-agencja wykonawcza'!N35)","v":0},{"$f":"SUM('11-państw.fund.cel.:90-agencja wykonawcza'!O35)","v":0},{"$f":"SUM('11-państw.fund.cel.:90-agencja wykonawcza'!P35)","v":0}]
["4. grupa III",null,null,{"$f":"SUM('11-państw.fund.cel.:90-agencja wykonawcza'!D36)","v":0},{"$f":"SUM('11-państw.fund.cel.:90-agencja wykonawcza'!E36)","v":0},{"$f":"SUM('11-państw.fund.cel.:90-agencja wykonawcza'!F36)","v":0},{"$f":"SUM('11-państw.fund.cel.:90-agencja wykonawcza'!G36)","v":0},null,null,"4. grupa III",null,null,{"$f":"SUM('11-państw.fund.cel.:90-agencja wykonawcza'!M36)","v":0},{"$f":"SUM('11-państw.fund.cel.:90-agencja wykonawcza'!N36)","v":0},{"$f":"SUM('11-państw.fund.cel.:90-agencja wykonawcza'!O36)","v":0},{"$f":"SUM('11-państw.fund.cel.:90-agencja wykonawcza'!P36)","v":0}]
["5.grupa IV",null,null,{"$f":"SUM('11-państw.fund.cel.:90-agencja wykonawcza'!D37)","v":0},{"$f":"SUM('11-państw.fund.cel.:90-agencja wykonawcza'!E37)","v":0},{"$f":"SUM('11-państw.fund.cel.:90-agencja wykonawcza'!F37)","v":0},{"$f":"SUM('11-państw.fund.cel.:90-agencja wykonawcza'!G37)","v":0},null,null,"5.grupa IV",null,null,{"$f":"SUM('11-państw.fund.cel.:90-agencja wykonawcza'!M37)","v":0},{"$f":"SUM('11-państw.fund.cel.:90-agencja wykonawcza'!N37)","v":0},{"$f":"SUM('11-państw.fund.cel.:90-agencja wykonawcza'!O37)","v":0},{"$f":"SUM('11-państw.fund.cel.:90-agencja wykonawcza'!P37)","v":0}]
["6. bank centralny",null,null,{"$f":"SUM('11-państw.fund.cel.:90-agencja wykonawcza'!D38)","v":0},{"$f":"SUM('11-państw.fund.cel.:90-agencja wykonawcza'!E38)","v":0},{"$f":"SUM('11-państw.fund.cel.:90-agencja wykonawcza'!F38)","v":0},{"$f":"SUM('11-państw.fund.cel.:90-agencja wykonawcza'!G38)","v":0},null,null,"6. bank centralny",null,null,{"$f":"SUM('11-państw.fund.cel.:90-agencja wykonawcza'!M38)","v":0},{"$f":"SUM('11-państw.fund.cel.:90-agencja wykonawcza'!N38)","v":0},{"$f":"SUM('11-państw.fund.cel.:90-agencja wykonawcza'!O38)","v":0},{"$f":"SUM('11-państw.fund.cel.:90-agencja wykonawcza'!P38)","v":0}]
["7. banki",null,null,{"$f":"SUM('11-państw.fund.cel.:90-agencja wykonawcza'!D39)","v":0},{"$f":"SUM('11-państw.fund.cel.:90-agencja wykonawcza'!E39)","v":0},{"$f":"SUM('11-państw.fund.cel.:90-agencja wykonawcza'!F39)","v":0},{"$f":"SUM('11-państw.fund.cel.:90-agencja wykonawcza'!G39)","v":0},null,null,"7. banki",null,null,{"$f":"SUM('11-państw.fund.cel.:90-agencja wykonawcza'!M39)","v":0},{"$f":"SUM('11-państw.fund.cel.:90-agencja wykonawcza'!N39)","v":0},{"$f":"SUM('11-państw.fund.cel.:90-agencja wykonawcza'!O39)","v":0},{"$f":"SUM('11-państw.fund.cel.:90-agencja wykonawcza'!P39)","v":0}]
["8. pozostałe krajowe instytucje finansowe",null,null,{"$f":"SUM('11-państw.fund.cel.:90-agencja wykonawcza'!D40)","v":0},{"$f":"SUM('11-państw.fund.cel.:90-agencja wykonawcza'!E40)","v":0},{"$f":"SUM('11-państw.fund.cel.:90-agencja wykonawcza'!F40)","v":0},{"$f":"SUM('11-państw.fund.cel.:90-agencja wykonawcza'!G40)","v":0},null,null,"8. pozostałe krajowe instytucje finansowe",null,null,{"$f":"SUM('11-państw.fund.cel.:90-agencja wykonawcza'!M40)","v":0},{"$f":"SUM('11-państw.fund.cel.:90-agencja wykonawcza'!N40)","v":0},{"$f":"SUM('11-państw.fund.cel.:90-agencja wykonawcza'!O40)","v":0},{"$f":"SUM('11-państw.fund.cel.:90-agencja wykonawcza'!P40)","v":0}]
["9. przedsiębiorstwa niefinansowe",null,null,{"$f":"SUM('11-państw.fund.cel.:90-agencja wykonawcza'!D41)","v":0},{"$f":"SUM('11-państw.fund.cel.:90-agencja wykonawcza'!E41)","v":0},{"$f":"SUM('11-państw.fund.cel.:90-agencja wykonawcza'!F41)","v":0},{"$f":"SUM('11-państw.fund.cel.:90-agencja wykonawcza'!G41)","v":0},null,null,"9. przedsiębiorstwa niefinansowe",null,null,{"$f":"SUM('11-państw.fund.cel.:90-agencja wykonawcza'!M41)","v":0},{"$f":"SUM('11-państw.fund.cel.:90-agencja wykonawcza'!N41)","v":0},{"$f":"SUM('11-państw.fund.cel.:90-agencja wykonawcza'!O41)","v":0},{"$f":"SUM('11-państw.fund.cel.:90-agencja wykonawcza'!P41)","v":0}]
["10. gospodarstwa domowe",null,null,{"$f":"SUM('11-państw.fund.cel.:90-agencja wykonawcza'!D42)","v":0},{"$f":"SUM('11-państw.fund.cel.:90-agencja wykonawcza'!E42)","v":0},{"$f":"SUM('11-państw.fund.cel.:90-agencja wykonawcza'!F42)","v":0},{"$f":"SUM('11-państw.fund.cel.:90-agencja wykonawcza'!G42)","v":0},null,null,"10. gospodarstwa domowe",null,null,{"$f":"SUM('11-państw.fund.cel.:90-agencja wykonawcza'!M42)","v":0},{"$f":"SUM('11-państw.fund.cel.:90-agencja wykonawcza'!N42)","v":0},{"$f":"SUM('11-państw.fund.cel.:90-agencja wykonawcza'!O42)","v":0},{"$f":"SUM('11-państw.fund.cel.:90-agencja wykonawcza'!P42)","v":0}]
["11. instytucje niekomercyjne działające na rzecz gospodarstw domowych",null,null,{"$f":"SUM('11-państw.fund.cel.:90-agencja wykonawcza'!D43)","v":0},{"$f":"SUM('11-państw.fund.cel.:90-agencja wykonawcza'!E43)","v":0},{"$f":"SUM('11-państw.fund.cel.:90-agencja wykonawcza'!F43)","v":0},{"$f":"SUM('11-państw.fund.cel.:90-agencja wykonawcza'!G43)","v":0},null,null,"11. instytucje niekomercyjne działające na rzecz gospodarstw domowych",null,null,{"$f":"SUM('11-państw.fund.cel.:90-agencja wykonawcza'!M43)","v":0},{"$f":"SUM('11-państw.fund.cel.:90-agencja wykonawcza'!N43)","v":0},{"$f":"SUM('11-państw.fund.cel.:90-agencja wykonawcza'!O43)","v":0},{"$f":"SUM('11-państw.fund.cel.:90-agencja wykonawcza'!P43)","v":0}]
["12. podmioty nalezące do strefy euro",null,null,{"$f":"SUM('11-państw.fund.cel.:90-agencja wykonawcza'!D44)","v":0},{"$f":"SUM('11-państw.fund.cel.:90-agencja wykonawcza'!E44)","v":0},{"$f":"SUM('11-państw.fund.cel.:90-agencja wykonawcza'!F44)","v":0},{"$f":"SUM('11-państw.fund.cel.:90-agencja wykonawcza'!G44)","v":0},null,null,"12. podmioty nalezące do strefy euro",null,null,{"$f":"SUM('11-państw.fund.cel.:90-agencja wykonawcza'!M44)","v":0},{"$f":"SUM('11-państw.fund.cel.:90-agencja wykonawcza'!N44)","v":0},{"$f":"SUM('11-państw.fund.cel.:90-agencja wykonawcza'!O44)","v":0},{"$f":"SUM('11-państw.fund.cel.:90-agencja wykonawcza'!P44)","v":0}]
["13. pozostałe podmioty zagraniczne",null,null,{"$f":"SUM('11-państw.fund.cel.:90-agencja wykonawcza'!D45)","v":0},{"$f":"SUM('11-państw.fund.cel.:90-agencja wykonawcza'!E45)","v":0},{"$f":"SUM('11-państw.fund.cel.:90-agencja wykonawcza'!F45)","v":0},{"$f":"SUM('11-państw.fund.cel.:90-agencja wykonawcza'!G45)","v":0},null,null,"13. pozostałe podmioty zagraniczne",null,null,{"$f":"SUM('11-państw.fund.cel.:90-agencja wykonawcza'!M45)","v":0},{"$f":"SUM('11-państw.fund.cel.:90-agencja wykonawcza'!N45)","v":0},{"$f":"SUM('11-państw.fund.cel.:90-agencja wykonawcza'!O45)","v":0},{"$f":"SUM('11-państw.fund.cel.:90-agencja wykonawcza'!P45)","v":0}]
[]
[" B3. kredyty i pożyczki wg pierwotnego terminu zapadalności - stan na koniec okresu sprawozdawczego",null,null,null,null,null,null,null,null," B4. kredyty i pożyczki wg pozostałego terminu zapadalności - stan na koniec okresu sprawozdawczego"]
["      (wg wartości nominalnej)",null,null,null,null,null,null,null,null,"      (wg wartości nominalnej)"]
[]
["kredyty i pożyczki",null,null,"zapadalność w latach",null,null,null,null,null,"kredyty i pożyczki",null,null,"zapadalność w latach"]
["wierzyciele",null,null,"łącznie       (kol. 3+4+5)","( 0;1>","( 1;5>","pow. 5",null,null,"wierzyciele",null,null,"łącznie         (kol. 3+4+5)","( 0;1>","( 1;5>","pow. 5"]
[1,null,null,2,3,4,5,null,null,1,null,null,2,3,4,5]
["1. łącznie (w. 2+3+4+5+6+7+8+9+10+11+12+13)",null,null,{"$f":"SUM('11-państw.fund.cel.:90-agencja wykonawcza'!D53)","v":0},{"$f":"SUM('11-państw.fund.cel.:90-agencja wykonawcza'!E53)","v":0},{"$f":"SUM('11-państw.fund.cel.:90-agencja wykonawcza'!F53)","v":0},{"$f":"SUM('11-państw.fund.cel.:90-agencja wykonawcza'!G53)","v":0},null,null,"1. łącznie (w. 2+3+4+5+6+7+8+9+10+11+12+13)",null,null,{"$f":"SUM('11-państw.fund.cel.:90-agencja wykonawcza'!M53)","v":0},{"$f":"SUM('11-państw.fund.cel.:90-agencja wykonawcza'!N53)","v":0},{"$f":"SUM('11-państw.fund.cel.:90-agencja wykonawcza'!O53)","v":0},{"$f":"SUM('11-państw.fund.cel.:90-agencja wykonawcza'!P53)","v":0}]
["2. grupa I",null,null,{"$f":"SUM('11-państw.fund.cel.:90-agencja wykonawcza'!D54)","v":0},{"$f":"SUM('11-państw.fund.cel.:90-agencja wykonawcza'!E54)","v":0},{"$f":"SUM('11-państw.fund.cel.:90-agencja wykonawcza'!F54)","v":0},{"$f":"SUM('11-państw.fund.cel.:90-agencja wykonawcza'!G54)","v":0},null,null,"2. grupa I",null,null,{"$f":"SUM('11-państw.fund.cel.:90-agencja wykonawcza'!M54)","v":0},{"$f":"SUM('11-państw.fund.cel.:90-agencja wykonawcza'!N54)","v":0},{"$f":"SUM('11-państw.fund.cel.:90-agencja wykonawcza'!O54)","v":0},{"$f":"SUM('11-państw.fund.cel.:90-agencja wykonawcza'!P54)","v":0}]
["3. grupa II",null,null,{"$f":"SUM('11-państw.fund.cel.:90-agencja wykonawcza'!D55)","v":0},{"$f":"SUM('11-państw.fund.cel.:90-agencja wykonawcza'!E55)","v":0},{"$f":"SUM('11-państw.fund.cel.:90-agencja wykonawcza'!F55)","v":0},{"$f":"SUM('11-państw.fund.cel.:90-agencja wykonawcza'!G55)","v":0},null,null,"3. grupa II",null,null,{"$f":"SUM('11-państw.fund.cel.:90-agencja wykonawcza'!M55)","v":0},{"$f":"SUM('11-państw.fund.cel.:90-agencja wykonawcza'!N55)","v":0},{"$f":"SUM('11-państw.fund.cel.:90-agencja wykonawcza'!O55)","v":0},{"$f":"SUM('11-państw.fund.cel.:90-agencja wykonawcza'!P55)","v":0}]
["4. grupa III",null,null,{"$f":"SUM('11-państw.fund.cel.:90-agencja wykonawcza'!D56)","v":0},{"$f":"SUM('11-państw.fund.cel.:90-agencja wykonawcza'!E56)","v":0},{"$f":"SUM('11-państw.fund.cel.:90-agencja wykonawcza'!F56)","v":0},{"$f":"SUM('11-państw.fund.cel.:90-agencja wykonawcza'!G56)","v":0},null,null,"4. grupa III",null,null,{"$f":"SUM('11-państw.fund.cel.:90-agencja wykonawcza'!M56)","v":0},{"$f":"SUM('11-państw.fund.cel.:90-agencja wykonawcza'!N56)","v":0},{"$f":"SUM('11-państw.fund.cel.:90-agencja wykonawcza'!O56)","v":0},{"$f":"SUM('11-państw.fund.cel.:90-agencja wykonawcza'!P56)","v":0}]
["5.grupa IV",null,null,{"$f":"SUM('11-państw.fund.cel.:90-agencja wykonawcza'!D57)","v":0},{"$f":"SUM('11-państw.fund.cel.:90-agencja wykonawcza'!E57)","v":0},{"$f":"SUM('11-państw.fund.cel.:90-agencja wykonawcza'!F57)","v":0},{"$f":"SUM('11-państw.fund.cel.:90-agencja wykonawcza'!G57)","v":0},null,null,"5.grupa IV",null,null,{"$f":"SUM('11-państw.fund.cel.:90-agencja wykonawcza'!M57)","v":0},{"$f":"SUM('11-państw.fund.cel.:90-agencja wykonawcza'!N57)","v":0},{"$f":"SUM('11-państw.fund.cel.:90-agencja wykonawcza'!O57)","v":0},{"$f":"SUM('11-państw.fund.cel.:90-agencja wykonawcza'!P57)","v":0}]
["6. bank centralny",null,null,{"$f":"SUM('11-państw.fund.cel.:90-agencja wykonawcza'!D58)","v":0},{"$f":"SUM('11-państw.fund.cel.:90-agencja wykonawcza'!E58)","v":0},{"$f":"SUM('11-państw.fund.cel.:90-agencja wykonawcza'!F58)","v":0},{"$f":"SUM('11-państw.fund.cel.:90-agencja wykonawcza'!G58)","v":0},null,null,"6. bank centralny",null,null,{"$f":"SUM('11-państw.fund.cel.:90-agencja wykonawcza'!M58)","v":0},{"$f":"SUM('11-państw.fund.cel.:90-agencja wykonawcza'!N58)","v":0},{"$f":"SUM('11-państw.fund.cel.:90-agencja wykonawcza'!O58)","v":0},{"$f":"SUM('11-państw.fund.cel.:90-agencja wykonawcza'!P58)","v":0}]
["7. banki",null,null,{"$f":"SUM('11-państw.fund.cel.:90-agencja wykonawcza'!D59)","v":0},{"$f":"SUM('11-państw.fund.cel.:90-agencja wykonawcza'!E59)","v":0},{"$f":"SUM('11-państw.fund.cel.:90-agencja wykonawcza'!F59)","v":0},{"$f":"SUM('11-państw.fund.cel.:90-agencja wykonawcza'!G59)","v":0},null,null,"7. banki",null,null,{"$f":"SUM('11-państw.fund.cel.:90-agencja wykonawcza'!M59)","v":0},{"$f":"SUM('11-państw.fund.cel.:90-agencja wykonawcza'!N59)","v":0},{"$f":"SUM('11-państw.fund.cel.:90-agencja wykonawcza'!O59)","v":0},{"$f":"SUM('11-państw.fund.cel.:90-agencja wykonawcza'!P59)","v":0}]
["8. pozostałe krajowe instytucje finansowe",null,null,{"$f":"SUM('11-państw.fund.cel.:90-agencja wykonawcza'!D60)","v":0},{"$f":"SUM('11-państw.fund.cel.:90-agencja wykonawcza'!E60)","v":0},{"$f":"SUM('11-państw.fund.cel.:90-agencja wykonawcza'!F60)","v":0},{"$f":"SUM('11-państw.fund.cel.:90-agencja wykonawcza'!G60)","v":0},null,null,"8. pozostałe krajowe instytucje finansowe",null,null,{"$f":"SUM('11-państw.fund.cel.:90-agencja wykonawcza'!M60)","v":0},{"$f":"SUM('11-państw.fund.cel.:90-agencja wykonawcza'!N60)","v":0},{"$f":"SUM('11-państw.fund.cel.:90-agencja wykonawcza'!O60)","v":0},{"$f":"SUM('11-państw.fund.cel.:90-agencja wykonawcza'!P60)","v":0}]
["9. przedsiębiorstwa niefinansowe",null,null,{"$f":"SUM('11-państw.fund.cel.:90-agencja wykonawcza'!D61)","v":0},{"$f":"SUM('11-państw.fund.cel.:90-agencja wykonawcza'!E61)","v":0},{"$f":"SUM('11-państw.fund.cel.:90-agencja wykonawcza'!F61)","v":0},{"$f":"SUM('11-państw.fund.cel.:90-agencja wykonawcza'!G61)","v":0},null,null,"9. przedsiębiorstwa niefinansowe",null,null,{"$f":"SUM('11-państw.fund.cel.:90-agencja wykonawcza'!M61)","v":0},{"$f":"SUM('11-państw.fund.cel.:90-agencja wykonawcza'!N61)","v":0},{"$f":"SUM('11-państw.fund.cel.:90-agencja wykonawcza'!O61)","v":0},{"$f":"SUM('11-państw.fund.cel.:90-agencja wykonawcza'!P61)","v":0}]
["10. gospodarstwa domowe",null,null,{"$f":"SUM('11-państw.fund.cel.:90-agencja wykonawcza'!D62)","v":0},{"$f":"SUM('11-państw.fund.cel.:90-agencja wykonawcza'!E62)","v":0},{"$f":"SUM('11-państw.fund.cel.:90-agencja wykonawcza'!F62)","v":0},{"$f":"SUM('11-państw.fund.cel.:90-agencja wykonawcza'!G62)","v":0},null,null,"10. gospodarstwa domowe",null,null,{"$f":"SUM('11-państw.fund.cel.:90-agencja wykonawcza'!M62)","v":0},{"$f":"SUM('11-państw.fund.cel.:90-agencja wykonawcza'!N62)","v":0},{"$f":"SUM('11-państw.fund.cel.:90-agencja wykonawcza'!O62)","v":0},{"$f":"SUM('11-państw.fund.cel.:90-agencja wykonawcza'!P62)","v":0}]
["11. instytucje niekomercyjne działające na rzecz gospodarstw domowych",null,null,{"$f":"SUM('11-państw.fund.cel.:90-agencja wykonawcza'!D63)","v":0},{"$f":"SUM('11-państw.fund.cel.:90-agencja wykonawcza'!E63)","v":0},{"$f":"SUM('11-państw.fund.cel.:90-agencja wykonawcza'!F63)","v":0},{"$f":"SUM('11-państw.fund.cel.:90-agencja wykonawcza'!G63)","v":0},null,null,"11. instytucje niekomercyjne działające na rzecz gospodarstw domowych",null,null,{"$f":"SUM('11-państw.fund.cel.:90-agencja wykonawcza'!M63)","v":0},{"$f":"SUM('11-państw.fund.cel.:90-agencja wykonawcza'!N63)","v":0},{"$f":"SUM('11-państw.fund.cel.:90-agencja wykonawcza'!O63)","v":0},{"$f":"SUM('11-państw.fund.cel.:90-agencja wykonawcza'!P63)","v":0}]
["12. podmioty nalezące do strefy euro",null,null,{"$f":"SUM('11-państw.fund.cel.:90-agencja wykonawcza'!D64)","v":0},{"$f":"SUM('11-państw.fund.cel.:90-agencja wykonawcza'!E64)","v":0},{"$f":"SUM('11-państw.fund.cel.:90-agencja wykonawcza'!F64)","v":0},{"$f":"SUM('11-państw.fund.cel.:90-agencja wykonawcza'!G64)","v":0},null,null,"12. podmioty nalezące do strefy euro",null,null,{"$f":"SUM('11-państw.fund.cel.:90-agencja wykonawcza'!M64)","v":0},{"$f":"SUM('11-państw.fund.cel.:90-agencja wykonawcza'!N64)","v":0},{"$f":"SUM('11-państw.fund.cel.:90-agencja wykonawcza'!O64)","v":0},{"$f":"SUM('11-państw.fund.cel.:90-agencja wykonawcza'!P64)","v":0}]
["13. pozostałe podmioty zagraniczne",null,null,{"$f":"SUM('11-państw.fund.cel.:90-agencja wykonawcza'!D65)","v":0},{"$f":"SUM('11-państw.fund.cel.:90-agencja wykonawcza'!E65)","v":0},{"$f":"SUM('11-państw.fund.cel.:90-agencja wykonawcza'!F65)","v":0},{"$f":"SUM('11-państw.fund.cel.:90-agencja wykonawcza'!G65)","v":0},null,null,"13. pozostałe podmioty zagraniczne",null,null,{"$f":"SUM('11-państw.fund.cel.:90-agencja wykonawcza'!M65)","v":0},{"$f":"SUM('11-państw.fund.cel.:90-agencja wykonawcza'!N65)","v":0},{"$f":"SUM('11-państw.fund.cel.:90-agencja wykonawcza'!O65)","v":0},{"$f":"SUM('11-państw.fund.cel.:90-agencja wykonawcza'!P65)","v":0}]
[]
[]
[]
[]
[]
[]
[]
[". . . . . . . . . . . . . . . . . . . . . . . . . . . . .  .  .",null,null,null,". . . . . . . . . . .",null,null,". . . . . . . . . . .",null,null,". . . . . . . . . . . . . . . . ."]
["Główny księgowy / Skarbnik",null,null,null,"telefon",null,null,"rok m-c dzień",null,null,"Kierownik jednostki (jednostki obsługującej)/ Przewodniczący Zarządu"]
["* Nie dotyczy sprawozdań zbiorczych sporządzanych przez RIO. W przypadku braku głównego księgowego podpisuje tylko kierownik jednostki."]
[]
[]
[]
[]
[]
[]
[]
[]
[]
[]
[]
[]
[]
[]
[]
[]
[]
[]
[]
[]
[]
[]
[]
["regform","niepusta"]
[{"$f":"'11-państw.fund.cel.'!A8:B8","v":0},{"$f":"ISTEXT(A100)","v":false}]
[{"$f":"#REF!","v":{"$error":"#REF!"}},false]
[{"$f":"'20-państw.szk.wyż.'!A8:B8","v":0},false]
[{"$f":"'31-instytucje gosp budż'!A8:B8","v":0},false]
[{"$f":"'41-państw.inst.kult.'!A8:B8","v":0},false]
[{"$f":"'42-samorz.inst.kult.'!A8:B8","v":0},false]
[{"$f":"'50-PAN i jedn.tworz.przez PAN'!A8:B8","v":0},false]
[{"$f":"'73-KRUS'!A8:B8","v":0},{"$f":"ISTEXT(A107)","v":false}]
[{"$f":"'61-samodz.publ.ZOZ państw.'!A8:B8","v":0},false]
[{"$f":"'62-samodz.publ.ZOZ samorz.'!A8:B8","v":0},false]
[{"$f":"'63-Narodowy Fundusz Zdrowia'!A8:B8","v":0},false]
[{"$f":"'72-fund.zarz.przez ZUS'!A8:B8","v":0},false]
[{"$f":"'81-państw.osoba prawna'!A8:B8","v":0},false]
[{"$f":"'82-samorz.osoba prawna'!A8:B8","v":0},false]
[{"$f":"'90-agencja wykonawcza'!A8:B8","v":0},false]
[{"$f":"'71-ZUS'!A8:B8","v":0},false]
[null,{"$f":"IF(B100=TRUE,A100,IF(B101=TRUE,A101,IF(B102=TRUE,A102,IF(B103=TRUE,A103,IF(B104=TRUE,A104,IF(B105=TRUE,A105,IF(B106=TRUE,A106,IF(B107=TRUE,A107,\"brak regonu\"))))))))","v":"brak regonu"}]
[null,{"$f":"IF(B108=TRUE,A108,IF(B109=TRUE,A109,IF(B110=TRUE,A110,IF(B111=TRUE,A111,IF(B112=TRUE,A112,IF(B113=TRUE,A113,IF(B114=TRUE,A114,IF(B115=TRUE,A115,\"brak regonu\"))))))))","v":"brak regonu"}]
[]
[]
[null,"nazwy"]
[{"$f":"'11-państw.fund.cel.'!A3:B3","v":0},{"$f":"ISTEXT(A121)","v":false}]
[{"$f":"#REF!","v":{"$error":"#REF!"}},false]
[{"$f":"'20-państw.szk.wyż.'!A3:B3","v":0},false]
[{"$f":"'31-instytucje gosp budż'!A3:B3","v":0},false]
[{"$f":"'41-państw.inst.kult.'!A3:B3","v":0},false]
[{"$f":"'42-samorz.inst.kult.'!A3:B3","v":0},false]
[{"$f":"'50-PAN i jedn.tworz.przez PAN'!A3:B3","v":0},false]
[{"$f":"'71-ZUS'!A3:B3","v":0},false]
[{"$f":"'61-samodz.publ.ZOZ państw.'!A3:B3","v":0},false]
[{"$f":"'62-samodz.publ.ZOZ samorz.'!A3:B3","v":0},false]
[{"$f":"'63-Narodowy Fundusz Zdrowia'!A3:B3","v":0},false]
[{"$f":"'72-fund.zarz.przez ZUS'!A3:B3","v":0},false]
[{"$f":"'81-państw.osoba prawna'!A3:B3","v":0},false]
[{"$f":"'82-samorz.osoba prawna'!A3:B3","v":0},false]
[{"$f":"'90-agencja wykonawcza'!A3:B3","v":0},false]
[{"$f":"'73-KRUS'!A3:B3","v":0},false]
[null,{"$f":"IF(B121=TRUE,A121,IF(B122=TRUE,A122,IF(B123=TRUE,A123,IF(B124=TRUE,A124,IF(B125=TRUE,A125,IF(B126=TRUE,A126,IF(B127=TRUE,A127,IF(B128=TRUE,A128,\"brak nazwy\"))))))))","v":"brak nazwy"}]
[null,{"$f":"IF(B129=TRUE,A129,IF(B130=TRUE,A130,IF(B131=TRUE,A131,IF(B132=TRUE,A132,IF(B133=TRUE,A133,IF(B134=TRUE,A134,IF(B135=TRUE,A135,IF(B136=TRUE,A136,\"brak nazwy\"))))))))","v":"brak nazwy"}]

{"sheet":"RBUZA","index":16,"n_rows":17,"n_cols":46,"rows_kept":17,"cut":false,"hidden":true,"merged":[]}
["REGON","WK","PK","GK","GT","PT","ROK","KWARTAL","CZ_BU","DAT_SKW","UWAGI","A1002","A1003","A1004","A1005","A1006","A1007","A1008","A1102","A1103","A1104","A1105","A1106","A1107","A1108","A1202","A1203","A1204","A1205","A1206","A1207","A1208","A1302","A1303","A1304","A1305","A1306","A1307","A1308","A1402","A1403","A1404","A1405","A1406","A1407","A1408"]
[{"$f":"'11-państw.fund.cel.'!A8","v":0},null,null,null,null,{"$f":"'11-państw.fund.cel.'!L11","v":11},{"$f":"'11-państw.fund.cel.'!K8","v":0},{"$f":"'11-państw.fund.cel.'!H8","v":4},{"$f":"'11-państw.fund.cel.'!M11","v":0},null,null,{"$f":"'11-państw.fund.cel.'!C19","v":0},{"$f":"'11-państw.fund.cel.'!D19","v":0},{"$f":"'11-państw.fund.cel.'!E19","v":0},{"$f":"'11-państw.fund.cel.'!F19","v":0},{"$f":"'11-państw.fund.cel.'!G19","v":0},{"$f":"'11-państw.fund.cel.'!H19","v":0},{"$f":"'11-państw.fund.cel.'!I19","v":0},{"$f":"'11-państw.fund.cel.'!C20","v":0},{"$f":"'11-państw.fund.cel.'!D20","v":0},{"$f":"'11-państw.fund.cel.'!E20","v":0},{"$f":"'11-państw.fund.cel.'!F20","v":0},{"$f":"'11-państw.fund.cel.'!G20","v":0},{"$f":"'11-państw.fund.cel.'!H20","v":0},{"$f":"'11-państw.fund.cel.'!I20","v":0},{"$f":"'11-państw.fund.cel.'!C21","v":0},{"$f":"'11-państw.fund.cel.'!D21","v":0},{"$f":"'11-państw.fund.cel.'!E21","v":0},{"$f":"'11-państw.fund.cel.'!F21","v":0},{"$f":"'11-państw.fund.cel.'!G21","v":0},{"$f":"'11-państw.fund.cel.'!H21","v":0},{"$f":"'11-państw.fund.cel.'!I21","v":0},{"$f":"'11-państw.fund.cel.'!C22","v":0},{"$f":"'11-państw.fund.cel.'!D22","v":0},{"$f":"'11-państw.fund.cel.'!E22","v":0},{"$f":"'11-państw.fund.cel.'!F22","v":0},{"$f":"'11-państw.fund.cel.'!G22","v":0},{"$f":"'11-państw.fund.cel.'!H22","v":0},{"$f":"'11-państw.fund.cel.'!I22","v":0},{"$f":"'11-państw.fund.cel.'!C23","v":0},{"$f":"'11-państw.fund.cel.'!D23","v":0},{"$f":"'11-państw.fund.cel.'!E23","v":0},{"$f":"'11-państw.fund.cel.'!F23","v":0},{"$f":"'11-państw.fund.cel.'!G23","v":0},{"$f":"'11-państw.fund.cel.'!H23","v":0},{"$f":"'11-państw.fund.cel.'!I23","v":0}]
[{"$f":"'20-państw.szk.wyż.'!A8","v":0},null,null,null,null,{"$f":"'20-państw.szk.wyż.'!L11","v":20},{"$f":"'20-państw.szk.wyż.'!K8","v":0},{"$f":"'20-państw.szk.wyż.'!H8","v":4},{"$f":"'20-państw.szk.wyż.'!M11","v":0},null,null,{"$f":"'20-państw.szk.wyż.'!C19","v":0},{"$f":"'20-państw.szk.wyż.'!D19","v":0},{"$f":"'20-państw.szk.wyż.'!E19","v":0},{"$f":"'20-państw.szk.wyż.'!F19","v":0},{"$f":"'20-państw.szk.wyż.'!G19","v":0},{"$f":"'20-państw.szk.wyż.'!H19","v":0},{"$f":"'20-państw.szk.wyż.'!I19","v":0},{"$f":"'20-państw.szk.wyż.'!C20","v":0},{"$f":"'20-państw.szk.wyż.'!D20","v":0},{"$f":"'20-państw.szk.wyż.'!E20","v":0},{"$f":"'20-państw.szk.wyż.'!F20","v":0},{"$f":"'20-państw.szk.wyż.'!G20","v":0},{"$f":"'20-państw.szk.wyż.'!H20","v":0},{"$f":"'20-państw.szk.wyż.'!I20","v":0},{"$f":"'20-państw.szk.wyż.'!C21","v":0},{"$f":"'20-państw.szk.wyż.'!D21","v":0},{"$f":"'20-państw.szk.wyż.'!E21","v":0},{"$f":"'20-państw.szk.wyż.'!F21","v":0},{"$f":"'20-państw.szk.wyż.'!G21","v":0},{"$f":"'20-państw.szk.wyż.'!H21","v":0},{"$f":"'20-państw.szk.wyż.'!I21","v":0},{"$f":"'20-państw.szk.wyż.'!C22","v":0},{"$f":"'20-państw.szk.wyż.'!D22","v":0},{"$f":"'20-państw.szk.wyż.'!E22","v":0},{"$f":"'20-państw.szk.wyż.'!F22","v":0},{"$f":"'20-państw.szk.wyż.'!G22","v":0},{"$f":"'20-państw.szk.wyż.'!H22","v":0},{"$f":"'20-państw.szk.wyż.'!I22","v":0},{"$f":"'20-państw.szk.wyż.'!C23","v":0},{"$f":"'20-państw.szk.wyż.'!D23","v":0},{"$f":"'20-państw.szk.wyż.'!E23","v":0},{"$f":"'20-państw.szk.wyż.'!F23","v":0},{"$f":"'20-państw.szk.wyż.'!G23","v":0},{"$f":"'20-państw.szk.wyż.'!H23","v":0},{"$f":"'20-państw.szk.wyż.'!I23","v":0}]
[{"$f":"'31-instytucje gosp budż'!A8","v":0},null,null,null,null,{"$f":"'31-instytucje gosp budż'!L11","v":31},{"$f":"'31-instytucje gosp budż'!K8","v":0},{"$f":"'31-instytucje gosp budż'!H8","v":4},{"$f":"'31-instytucje gosp budż'!M11","v":0},null,null,{"$f":"'31-instytucje gosp budż'!C19","v":0},{"$f":"'31-instytucje gosp budż'!D19","v":0},{"$f":"'31-instytucje gosp budż'!E19","v":0},{"$f":"'31-instytucje gosp budż'!F19","v":0},{"$f":"'31-instytucje gosp budż'!G19","v":0},{"$f":"'31-instytucje gosp budż'!H19","v":0},{"$f":"'31-instytucje gosp budż'!I19","v":0},{"$f":"'31-instytucje gosp budż'!C20","v":0},{"$f":"'31-instytucje gosp budż'!D20","v":0},{"$f":"'31-instytucje gosp budż'!E20","v":0},{"$f":"'31-instytucje gosp budż'!F20","v":0},{"$f":"'31-instytucje gosp budż'!G20","v":0},{"$f":"'31-instytucje gosp budż'!H20","v":0},{"$f":"'31-instytucje gosp budż'!I20","v":0},{"$f":"'31-instytucje gosp budż'!C21","v":0},{"$f":"'31-instytucje gosp budż'!D21","v":0},{"$f":"'31-instytucje gosp budż'!E21","v":0},{"$f":"'31-instytucje gosp budż'!F21","v":0},{"$f":"'31-instytucje gosp budż'!G21","v":0},{"$f":"'31-instytucje gosp budż'!H21","v":0},{"$f":"'31-instytucje gosp budż'!I21","v":0},{"$f":"'31-instytucje gosp budż'!C22","v":0},{"$f":"'31-instytucje gosp budż'!D22","v":0},{"$f":"'31-instytucje gosp budż'!E22","v":0},{"$f":"'31-instytucje gosp budż'!F22","v":0},{"$f":"'31-instytucje gosp budż'!G22","v":0},{"$f":"'31-instytucje gosp budż'!H22","v":0},{"$f":"'31-instytucje gosp budż'!I22","v":0},{"$f":"'31-instytucje gosp budż'!C23","v":0},{"$f":"'31-instytucje gosp budż'!D23","v":0},{"$f":"'31-instytucje gosp budż'!E23","v":0},{"$f":"'31-instytucje gosp budż'!F23","v":0},{"$f":"'31-instytucje gosp budż'!G23","v":0},{"$f":"'31-instytucje gosp budż'!H23","v":0},{"$f":"'31-instytucje gosp budż'!I23","v":0}]
[{"$f":"'41-państw.inst.kult.'!A8","v":0},null,null,null,null,{"$f":"'41-państw.inst.kult.'!L11","v":41},{"$f":"'41-państw.inst.kult.'!K8","v":0},{"$f":"'41-państw.inst.kult.'!H8","v":4},{"$f":"'41-państw.inst.kult.'!M11","v":0},null,null,{"$f":"'41-państw.inst.kult.'!C19","v":0},{"$f":"'41-państw.inst.kult.'!D19","v":0},{"$f":"'41-państw.inst.kult.'!E19","v":0},{"$f":"'41-państw.inst.kult.'!F19","v":0},{"$f":"'41-państw.inst.kult.'!G19","v":0},{"$f":"'41-państw.inst.kult.'!H19","v":0},{"$f":"'41-państw.inst.kult.'!I19","v":0},{"$f":"'41-państw.inst.kult.'!C20","v":0},{"$f":"'41-państw.inst.kult.'!D20","v":0},{"$f":"'41-państw.inst.kult.'!E20","v":0},{"$f":"'41-państw.inst.kult.'!F20","v":0},{"$f":"'41-państw.inst.kult.'!G20","v":0},{"$f":"'41-państw.inst.kult.'!H20","v":0},{"$f":"'41-państw.inst.kult.'!I20","v":0},{"$f":"'41-państw.inst.kult.'!C21","v":0},{"$f":"'41-państw.inst.kult.'!D21","v":0},{"$f":"'41-państw.inst.kult.'!E21","v":0},{"$f":"'41-państw.inst.kult.'!F21","v":0},{"$f":"'41-państw.inst.kult.'!G21","v":0},{"$f":"'41-państw.inst.kult.'!H21","v":0},{"$f":"'41-państw.inst.kult.'!I21","v":0},{"$f":"'41-państw.inst.kult.'!C22","v":0},{"$f":"'41-państw.inst.kult.'!D22","v":0},{"$f":"'41-państw.inst.kult.'!E22","v":0},{"$f":"'41-państw.inst.kult.'!F22","v":0},{"$f":"'41-państw.inst.kult.'!G22","v":0},{"$f":"'41-państw.inst.kult.'!H22","v":0},{"$f":"'41-państw.inst.kult.'!I22","v":0},{"$f":"'41-państw.inst.kult.'!C23","v":0},{"$f":"'41-państw.inst.kult.'!D23","v":0},{"$f":"'41-państw.inst.kult.'!E23","v":0},{"$f":"'41-państw.inst.kult.'!F23","v":0},{"$f":"'41-państw.inst.kult.'!G23","v":0},{"$f":"'41-państw.inst.kult.'!H23","v":0},{"$f":"'41-państw.inst.kult.'!I23","v":0}]
[{"$f":"'42-samorz.inst.kult.'!A8","v":0},null,null,null,null,{"$f":"'42-samorz.inst.kult.'!L11","v":42},{"$f":"'42-samorz.inst.kult.'!K8","v":0},{"$f":"'42-samorz.inst.kult.'!H8","v":4},{"$f":"'42-samorz.inst.kult.'!M11","v":0},null,null,{"$f":"'42-samorz.inst.kult.'!C19","v":0},{"$f":"'42-samorz.inst.kult.'!D19","v":0},{"$f":"'42-samorz.inst.kult.'!E19","v":0},{"$f":"'42-samorz.inst.kult.'!F19","v":0},{"$f":"'42-samorz.inst.kult.'!G19","v":0},{"$f":"'42-samorz.inst.kult.'!H19","v":0},{"$f":"'42-samorz.inst.kult.'!I19","v":0},{"$f":"'42-samorz.inst.kult.'!C20","v":0},{"$f":"'42-samorz.inst.kult.'!D20","v":0},{"$f":"'42-samorz.inst.kult.'!E20","v":0},{"$f":"'42-samorz.inst.kult.'!F20","v":0},{"$f":"'42-samorz.inst.kult.'!G20","v":0},{"$f":"'42-samorz.inst.kult.'!H20","v":0},{"$f":"'42-samorz.inst.kult.'!I20","v":0},{"$f":"'42-samorz.inst.kult.'!C21","v":0},{"$f":"'42-samorz.inst.kult.'!D21","v":0},{"$f":"'42-samorz.inst.kult.'!E21","v":0},{"$f":"'42-samorz.inst.kult.'!F21","v":0},{"$f":"'42-samorz.inst.kult.'!G21","v":0},{"$f":"'42-samorz.inst.kult.'!H21","v":0},{"$f":"'42-samorz.inst.kult.'!I21","v":0},{"$f":"'42-samorz.inst.kult.'!C22","v":0},{"$f":"'42-samorz.inst.kult.'!D22","v":0},{"$f":"'42-samorz.inst.kult.'!E22","v":0},{"$f":"'42-samorz.inst.kult.'!F22","v":0},{"$f":"'42-samorz.inst.kult.'!G22","v":0},{"$f":"'42-samorz.inst.kult.'!H22","v":0},{"$f":"'42-samorz.inst.kult.'!I22","v":0},{"$f":"'42-samorz.inst.kult.'!C23","v":0},{"$f":"'42-samorz.inst.kult.'!D23","v":0},{"$f":"'42-samorz.inst.kult.'!E23","v":0},{"$f":"'42-samorz.inst.kult.'!F23","v":0},{"$f":"'42-samorz.inst.kult.'!G23","v":0},{"$f":"'42-samorz.inst.kult.'!H23","v":0},{"$f":"'42-samorz.inst.kult.'!I23","v":0}]
[{"$f":"'50-PAN i jedn.tworz.przez PAN'!A8","v":0},null,null,null,null,{"$f":"'50-PAN i jedn.tworz.przez PAN'!L11","v":50},{"$f":"'50-PAN i jedn.tworz.przez PAN'!K8","v":0},{"$f":"'50-PAN i jedn.tworz.przez PAN'!H8","v":4},{"$f":"'50-PAN i jedn.tworz.przez PAN'!M11","v":0},null,null,{"$f":"'50-PAN i jedn.tworz.przez PAN'!C19","v":0},{"$f":"'50-PAN i jedn.tworz.przez PAN'!D19","v":0},{"$f":"'50-PAN i jedn.tworz.przez PAN'!E19","v":0},{"$f":"'50-PAN i jedn.tworz.przez PAN'!F19","v":0},{"$f":"'50-PAN i jedn.tworz.przez PAN'!G19","v":0},{"$f":"'50-PAN i jedn.tworz.przez PAN'!H19","v":0},{"$f":"'50-PAN i jedn.tworz.przez PAN'!I19","v":0},{"$f":"'50-PAN i jedn.tworz.przez PAN'!C20","v":0},{"$f":"'50-PAN i jedn.tworz.przez PAN'!D20","v":0},{"$f":"'50-PAN i jedn.tworz.przez PAN'!E20","v":0},{"$f":"'50-PAN i jedn.tworz.przez PAN'!F20","v":0},{"$f":"'50-PAN i jedn.tworz.przez PAN'!G20","v":0},{"$f":"'50-PAN i jedn.tworz.przez PAN'!H20","v":0},{"$f":"'50-PAN i jedn.tworz.przez PAN'!I20","v":0},{"$f":"'50-PAN i jedn.tworz.przez PAN'!C21","v":0},{"$f":"'50-PAN i jedn.tworz.przez PAN'!D21","v":0},{"$f":"'50-PAN i jedn.tworz.przez PAN'!E21","v":0},{"$f":"'50-PAN i jedn.tworz.przez PAN'!F21","v":0},{"$f":"'50-PAN i jedn.tworz.przez PAN'!G21","v":0},{"$f":"'50-PAN i jedn.tworz.przez PAN'!H21","v":0},{"$f":"'50-PAN i jedn.tworz.przez PAN'!I21","v":0},{"$f":"'50-PAN i jedn.tworz.przez PAN'!C22","v":0},{"$f":"'50-PAN i jedn.tworz.przez PAN'!D22","v":0},{"$f":"'50-PAN i jedn.tworz.przez PAN'!E22","v":0},{"$f":"'50-PAN i jedn.tworz.przez PAN'!F22","v":0},{"$f":"'50-PAN i jedn.tworz.przez PAN'!G22","v":0},{"$f":"'50-PAN i jedn.tworz.przez PAN'!H22","v":0},{"$f":"'50-PAN i jedn.tworz.przez PAN'!I22","v":0},{"$f":"'50-PAN i jedn.tworz.przez PAN'!C23","v":0},{"$f":"'50-PAN i jedn.tworz.przez PAN'!D23","v":0},{"$f":"'50-PAN i jedn.tworz.przez PAN'!E23","v":0},{"$f":"'50-PAN i jedn.tworz.przez PAN'!F23","v":0},{"$f":"'50-PAN i jedn.tworz.przez PAN'!G23","v":0},{"$f":"'50-PAN i jedn.tworz.przez PAN'!H23","v":0},{"$f":"'50-PAN i jedn.tworz.przez PAN'!I23","v":0}]
[{"$f":"'61-samodz.publ.ZOZ państw.'!A8","v":0},null,null,null,null,{"$f":"'61-samodz.publ.ZOZ państw.'!L11","v":61},{"$f":"'61-samodz.publ.ZOZ państw.'!K8","v":0},{"$f":"'61-samodz.publ.ZOZ państw.'!H8","v":4},{"$f":"'61-samodz.publ.ZOZ państw.'!M11","v":0},null,null,{"$f":"'61-samodz.publ.ZOZ państw.'!C19","v":0},{"$f":"'61-samodz.publ.ZOZ państw.'!D19","v":0},{"$f":"'61-samodz.publ.ZOZ państw.'!E19","v":0},{"$f":"'61-samodz.publ.ZOZ państw.'!F19","v":0},{"$f":"'61-samodz.publ.ZOZ państw.'!G19","v":0},{"$f":"'61-samodz.publ.ZOZ państw.'!H19","v":0},{"$f":"'61-samodz.publ.ZOZ państw.'!I19","v":0},{"$f":"'61-samodz.publ.ZOZ państw.'!C20","v":0},{"$f":"'61-samodz.publ.ZOZ państw.'!D20","v":0},{"$f":"'61-samodz.publ.ZOZ państw.'!E20","v":0},{"$f":"'61-samodz.publ.ZOZ państw.'!F20","v":0},{"$f":"'61-samodz.publ.ZOZ państw.'!G20","v":0},{"$f":"'61-samodz.publ.ZOZ państw.'!H20","v":0},{"$f":"'61-samodz.publ.ZOZ państw.'!I20","v":0},{"$f":"'61-samodz.publ.ZOZ państw.'!C21","v":0},{"$f":"'61-samodz.publ.ZOZ państw.'!D21","v":0},{"$f":"'61-samodz.publ.ZOZ państw.'!E21","v":0},{"$f":"'61-samodz.publ.ZOZ państw.'!F21","v":0},{"$f":"'61-samodz.publ.ZOZ państw.'!G21","v":0},{"$f":"'61-samodz.publ.ZOZ państw.'!H21","v":0},{"$f":"'61-samodz.publ.ZOZ państw.'!I21","v":0},{"$f":"'61-samodz.publ.ZOZ państw.'!C22","v":0},{"$f":"'61-samodz.publ.ZOZ państw.'!D22","v":0},{"$f":"'61-samodz.publ.ZOZ państw.'!E22","v":0},{"$f":"'61-samodz.publ.ZOZ państw.'!F22","v":0},{"$f":"'61-samodz.publ.ZOZ państw.'!G22","v":0},{"$f":"'61-samodz.publ.ZOZ państw.'!H22","v":0},{"$f":"'61-samodz.publ.ZOZ państw.'!I22","v":0},{"$f":"'61-samodz.publ.ZOZ państw.'!C23","v":0},{"$f":"'61-samodz.publ.ZOZ państw.'!D23","v":0},{"$f":"'61-samodz.publ.ZOZ państw.'!E23","v":0},{"$f":"'61-samodz.publ.ZOZ państw.'!F23","v":0},{"$f":"'61-samodz.publ.ZOZ państw.'!G23","v":0},{"$f":"'61-samodz.publ.ZOZ państw.'!H23","v":0},{"$f":"'61-samodz.publ.ZOZ państw.'!I23","v":0}]
[{"$f":"'62-samodz.publ.ZOZ samorz.'!A8","v":0},null,null,null,null,{"$f":"'62-samodz.publ.ZOZ samorz.'!L11","v":62},{"$f":"'62-samodz.publ.ZOZ samorz.'!K8","v":0},{"$f":"'62-samodz.publ.ZOZ samorz.'!H8","v":4},{"$f":"'62-samodz.publ.ZOZ samorz.'!M11","v":0},null,null,{"$f":"'62-samodz.publ.ZOZ samorz.'!C19","v":0},{"$f":"'62-samodz.publ.ZOZ samorz.'!D19","v":0},{"$f":"'62-samodz.publ.ZOZ samorz.'!E19","v":0},{"$f":"'62-samodz.publ.ZOZ samorz.'!F19","v":0},{"$f":"'62-samodz.publ.ZOZ samorz.'!G19","v":0},{"$f":"'62-samodz.publ.ZOZ samorz.'!H19","v":0},{"$f":"'62-samodz.publ.ZOZ samorz.'!I19","v":0},{"$f":"'62-samodz.publ.ZOZ samorz.'!C20","v":0},{"$f":"'62-samodz.publ.ZOZ samorz.'!D20","v":0},{"$f":"'62-samodz.publ.ZOZ samorz.'!E20","v":0},{"$f":"'62-samodz.publ.ZOZ samorz.'!F20","v":0},{"$f":"'62-samodz.publ.ZOZ samorz.'!G20","v":0},{"$f":"'62-samodz.publ.ZOZ samorz.'!H20","v":0},{"$f":"'62-samodz.publ.ZOZ samorz.'!I20","v":0},{"$f":"'62-samodz.publ.ZOZ samorz.'!C21","v":0},{"$f":"'62-samodz.publ.ZOZ samorz.'!D21","v":0},{"$f":"'62-samodz.publ.ZOZ samorz.'!E21","v":0},{"$f":"'62-samodz.publ.ZOZ samorz.'!F21","v":0},{"$f":"'62-samodz.publ.ZOZ samorz.'!G21","v":0},{"$f":"'62-samodz.publ.ZOZ samorz.'!H21","v":0},{"$f":"'62-samodz.publ.ZOZ samorz.'!I21","v":0},{"$f":"'62-samodz.publ.ZOZ samorz.'!C22","v":0},{"$f":"'62-samodz.publ.ZOZ samorz.'!D22","v":0},{"$f":"'62-samodz.publ.ZOZ samorz.'!E22","v":0},{"$f":"'62-samodz.publ.ZOZ samorz.'!F22","v":0},{"$f":"'62-samodz.publ.ZOZ samorz.'!G22","v":0},{"$f":"'62-samodz.publ.ZOZ samorz.'!H22","v":0},{"$f":"'62-samodz.publ.ZOZ samorz.'!I22","v":0},{"$f":"'62-samodz.publ.ZOZ samorz.'!C23","v":0},{"$f":"'62-samodz.publ.ZOZ samorz.'!D23","v":0},{"$f":"'62-samodz.publ.ZOZ samorz.'!E23","v":0},{"$f":"'62-samodz.publ.ZOZ samorz.'!F23","v":0},{"$f":"'62-samodz.publ.ZOZ samorz.'!G23","v":0},{"$f":"'62-samodz.publ.ZOZ samorz.'!H23","v":0},{"$f":"'62-samodz.publ.ZOZ samorz.'!I23","v":0}]
[{"$f":"'63-Narodowy Fundusz Zdrowia'!A8","v":0},null,null,null,null,{"$f":"'63-Narodowy Fundusz Zdrowia'!L11","v":63},{"$f":"'63-Narodowy Fundusz Zdrowia'!K8","v":0},{"$f":"'63-Narodowy Fundusz Zdrowia'!H8","v":4},{"$f":"'63-Narodowy Fundusz Zdrowia'!M11","v":0},null,null,{"$f":"'63-Narodowy Fundusz Zdrowia'!C19","v":0},{"$f":"'63-Narodowy Fundusz Zdrowia'!D19","v":0},{"$f":"'63-Narodowy Fundusz Zdrowia'!E19","v":0},{"$f":"'63-Narodowy Fundusz Zdrowia'!F19","v":0},{"$f":"'63-Narodowy Fundusz Zdrowia'!G19","v":0},{"$f":"'63-Narodowy Fundusz Zdrowia'!H19","v":0},{"$f":"'63-Narodowy Fundusz Zdrowia'!I19","v":0},{"$f":"'63-Narodowy Fundusz Zdrowia'!C20","v":0},{"$f":"'63-Narodowy Fundusz Zdrowia'!D20","v":0},{"$f":"'63-Narodowy Fundusz Zdrowia'!E20","v":0},{"$f":"'63-Narodowy Fundusz Zdrowia'!F20","v":0},{"$f":"'63-Narodowy Fundusz Zdrowia'!G20","v":0},{"$f":"'63-Narodowy Fundusz Zdrowia'!H20","v":0},{"$f":"'63-Narodowy Fundusz Zdrowia'!I20","v":0},{"$f":"'63-Narodowy Fundusz Zdrowia'!C21","v":0},{"$f":"'63-Narodowy Fundusz Zdrowia'!D21","v":0},{"$f":"'63-Narodowy Fundusz Zdrowia'!E21","v":0},{"$f":"'63-Narodowy Fundusz Zdrowia'!F21","v":0},{"$f":"'63-Narodowy Fundusz Zdrowia'!G21","v":0},{"$f":"'63-Narodowy Fundusz Zdrowia'!H21","v":0},{"$f":"'63-Narodowy Fundusz Zdrowia'!I21","v":0},{"$f":"'63-Narodowy Fundusz Zdrowia'!C22","v":0},{"$f":"'63-Narodowy Fundusz Zdrowia'!D22","v":0},{"$f":"'63-Narodowy Fundusz Zdrowia'!E22","v":0},{"$f":"'63-Narodowy Fundusz Zdrowia'!F22","v":0},{"$f":"'63-Narodowy Fundusz Zdrowia'!G22","v":0},{"$f":"'63-Narodowy Fundusz Zdrowia'!H22","v":0},{"$f":"'63-Narodowy Fundusz Zdrowia'!I22","v":0},{"$f":"'63-Narodowy Fundusz Zdrowia'!C23","v":0},{"$f":"'63-Narodowy Fundusz Zdrowia'!D23","v":0},{"$f":"'63-Narodowy Fundusz Zdrowia'!E23","v":0},{"$f":"'63-Narodowy Fundusz Zdrowia'!F23","v":0},{"$f":"'63-Narodowy Fundusz Zdrowia'!G23","v":0},{"$f":"'63-Narodowy Fundusz Zdrowia'!H23","v":0},{"$f":"'63-Narodowy Fundusz Zdrowia'!I23","v":0}]
[{"$f":"'71-ZUS'!A8","v":0},null,null,null,null,{"$f":"'71-ZUS'!L11","v":71},{"$f":"'71-ZUS'!K8","v":0},{"$f":"'71-ZUS'!H8","v":4},{"$f":"'71-ZUS'!M11","v":0},null,null,{"$f":"'71-ZUS'!C19","v":0},{"$f":"'71-ZUS'!D19","v":0},{"$f":"'71-ZUS'!E19","v":0},{"$f":"'71-ZUS'!F19","v":0},{"$f":"'71-ZUS'!G19","v":0},{"$f":"'71-ZUS'!H19","v":0},{"$f":"'71-ZUS'!I19","v":0},{"$f":"'71-ZUS'!C20","v":0},{"$f":"'71-ZUS'!D20","v":0},{"$f":"'71-ZUS'!E20","v":0},{"$f":"'71-ZUS'!F20","v":0},{"$f":"'71-ZUS'!G20","v":0},{"$f":"'71-ZUS'!H20","v":0},{"$f":"'71-ZUS'!I20","v":0},{"$f":"'71-ZUS'!C21","v":0},{"$f":"'71-ZUS'!D21","v":0},{"$f":"'71-ZUS'!E21","v":0},{"$f":"'71-ZUS'!F21","v":0},{"$f":"'71-ZUS'!G21","v":0},{"$f":"'71-ZUS'!H21","v":0},{"$f":"'71-ZUS'!I21","v":0},{"$f":"'71-ZUS'!C22","v":0},{"$f":"'71-ZUS'!D22","v":0},{"$f":"'71-ZUS'!E22","v":0},{"$f":"'71-ZUS'!F22","v":0},{"$f":"'71-ZUS'!G22","v":0},{"$f":"'71-ZUS'!H22","v":0},{"$f":"'71-ZUS'!I22","v":0},{"$f":"'71-ZUS'!C23","v":0},{"$f":"'71-ZUS'!D23","v":0},{"$f":"'71-ZUS'!E23","v":0},{"$f":"'71-ZUS'!F23","v":0},{"$f":"'71-ZUS'!G23","v":0},{"$f":"'71-ZUS'!H23","v":0},{"$f":"'71-ZUS'!I23","v":0}]
[{"$f":"'72-fund.zarz.przez ZUS'!A8:B8","v":0},null,null,null,null,{"$f":"'72-fund.zarz.przez ZUS'!L11","v":72},{"$f":"'72-fund.zarz.przez ZUS'!K8","v":0},{"$f":"'72-fund.zarz.przez ZUS'!H8","v":4},{"$f":"'72-fund.zarz.przez ZUS'!M11","v":0},null,null,{"$f":"'72-fund.zarz.przez ZUS'!C19","v":0},{"$f":"'72-fund.zarz.przez ZUS'!D19","v":0},{"$f":"'72-fund.zarz.przez ZUS'!E19","v":0},{"$f":"'72-fund.zarz.przez ZUS'!F19","v":0},{"$f":"'72-fund.zarz.przez ZUS'!G19","v":0},{"$f":"'72-fund.zarz.przez ZUS'!H19","v":0},{"$f":"'72-fund.zarz.przez ZUS'!I19","v":0},{"$f":"'72-fund.zarz.przez ZUS'!C20","v":0},{"$f":"'72-fund.zarz.przez ZUS'!D20","v":0},{"$f":"'72-fund.zarz.przez ZUS'!E20","v":0},{"$f":"'72-fund.zarz.przez ZUS'!F20","v":0},{"$f":"'72-fund.zarz.przez ZUS'!G20","v":0},{"$f":"'72-fund.zarz.przez ZUS'!H20","v":0},{"$f":"'72-fund.zarz.przez ZUS'!I20","v":0},{"$f":"'72-fund.zarz.przez ZUS'!C21","v":0},{"$f":"'72-fund.zarz.przez ZUS'!D21","v":0},{"$f":"'72-fund.zarz.przez ZUS'!E21","v":0},{"$f":"'72-fund.zarz.przez ZUS'!F21","v":0},{"$f":"'72-fund.zarz.przez ZUS'!G21","v":0},{"$f":"'72-fund.zarz.przez ZUS'!H21","v":0},{"$f":"'72-fund.zarz.przez ZUS'!I21","v":0},{"$f":"'72-fund.zarz.przez ZUS'!C22","v":0},{"$f":"'72-fund.zarz.przez ZUS'!D22","v":0},{"$f":"'72-fund.zarz.przez ZUS'!E22","v":0},{"$f":"'72-fund.zarz.przez ZUS'!F22","v":0},{"$f":"'72-fund.zarz.przez ZUS'!G22","v":0},{"$f":"'72-fund.zarz.przez ZUS'!H22","v":0},{"$f":"'72-fund.zarz.przez ZUS'!I22","v":0},{"$f":"'72-fund.zarz.przez ZUS'!C23","v":0},{"$f":"'72-fund.zarz.przez ZUS'!D23","v":0},{"$f":"'72-fund.zarz.przez ZUS'!E23","v":0},{"$f":"'72-fund.zarz.przez ZUS'!F23","v":0},{"$f":"'72-fund.zarz.przez ZUS'!G23","v":0},{"$f":"'72-fund.zarz.przez ZUS'!H23","v":0},{"$f":"'72-fund.zarz.przez ZUS'!I23","v":0}]
[{"$f":"'73-KRUS'!A8:B8","v":0},null,null,null,null,{"$f":"'73-KRUS'!L11","v":73},{"$f":"'73-KRUS'!K8","v":0},{"$f":"'73-KRUS'!H8","v":4},{"$f":"'73-KRUS'!M11","v":0},null,null,{"$f":"'73-KRUS'!C19","v":0},{"$f":"'73-KRUS'!D19","v":0},{"$f":"'73-KRUS'!E19","v":0},{"$f":"'73-KRUS'!F19","v":0},{"$f":"'73-KRUS'!G19","v":0},{"$f":"'73-KRUS'!H19","v":0},{"$f":"'73-KRUS'!I19","v":0},{"$f":"'73-KRUS'!C20","v":0},{"$f":"'73-KRUS'!D20","v":0},{"$f":"'73-KRUS'!E20","v":0},{"$f":"'73-KRUS'!F20","v":0},{"$f":"'73-KRUS'!G20","v":0},{"$f":"'73-KRUS'!H20","v":0},{"$f":"'73-KRUS'!I20","v":0},{"$f":"'73-KRUS'!C21","v":0},{"$f":"'73-KRUS'!D21","v":0},{"$f":"'73-KRUS'!E21","v":0},{"$f":"'73-KRUS'!F21","v":0},{"$f":"'73-KRUS'!G21","v":0},{"$f":"'73-KRUS'!H21","v":0},{"$f":"'73-KRUS'!I21","v":0},{"$f":"'73-KRUS'!C22","v":0},{"$f":"'73-KRUS'!D22","v":0},{"$f":"'73-KRUS'!E22","v":0},{"$f":"'73-KRUS'!F22","v":0},{"$f":"'73-KRUS'!G22","v":0},{"$f":"'73-KRUS'!H22","v":0},{"$f":"'73-KRUS'!I22","v":0},{"$f":"'73-KRUS'!C23","v":0},{"$f":"'73-KRUS'!D23","v":0},{"$f":"'73-KRUS'!E23","v":0},{"$f":"'73-KRUS'!F23","v":0},{"$f":"'73-KRUS'!G23","v":0},{"$f":"'73-KRUS'!H23","v":0},{"$f":"'73-KRUS'!I23","v":0}]
[{"$f":"'81-państw.osoba prawna'!A8","v":0},null,null,null,null,{"$f":"'81-państw.osoba prawna'!L11","v":81},{"$f":"'81-państw.osoba prawna'!K8","v":0},{"$f":"'81-państw.osoba prawna'!H8","v":4},{"$f":"'81-państw.osoba prawna'!M11","v":0},null,null,{"$f":"'81-państw.osoba prawna'!C19","v":0},{"$f":"'81-państw.osoba prawna'!D19","v":0},{"$f":"'81-państw.osoba prawna'!E19","v":0},{"$f":"'81-państw.osoba prawna'!F19","v":0},{"$f":"'81-państw.osoba prawna'!G19","v":0},{"$f":"'81-państw.osoba prawna'!H19","v":0},{"$f":"'81-państw.osoba prawna'!I19","v":0},{"$f":"'81-państw.osoba prawna'!C20","v":0},{"$f":"'81-państw.osoba prawna'!D20","v":0},{"$f":"'81-państw.osoba prawna'!E20","v":0},{"$f":"'81-państw.osoba prawna'!F20","v":0},{"$f":"'81-państw.osoba prawna'!G20","v":0},{"$f":"'81-państw.osoba prawna'!H20","v":0},{"$f":"'81-państw.osoba prawna'!I20","v":0},{"$f":"'81-państw.osoba prawna'!C21","v":0},{"$f":"'81-państw.osoba prawna'!D21","v":0},{"$f":"'81-państw.osoba prawna'!E21","v":0},{"$f":"'81-państw.osoba prawna'!F21","v":0},{"$f":"'81-państw.osoba prawna'!G21","v":0},{"$f":"'81-państw.osoba prawna'!H21","v":0},{"$f":"'81-państw.osoba prawna'!I21","v":0},{"$f":"'81-państw.osoba prawna'!C22","v":0},{"$f":"'81-państw.osoba prawna'!D22","v":0},{"$f":"'81-państw.osoba prawna'!E22","v":0},{"$f":"'81-państw.osoba prawna'!F22","v":0},{"$f":"'81-państw.osoba prawna'!G22","v":0},{"$f":"'81-państw.osoba prawna'!H22","v":0},{"$f":"'81-państw.osoba prawna'!I22","v":0},{"$f":"'81-państw.osoba prawna'!C23","v":0},{"$f":"'81-państw.osoba prawna'!D23","v":0},{"$f":"'81-państw.osoba prawna'!E23","v":0},{"$f":"'81-państw.osoba prawna'!F23","v":0},{"$f":"'81-państw.osoba prawna'!G23","v":0},{"$f":"'81-państw.osoba prawna'!H23","v":0},{"$f":"'81-państw.osoba prawna'!I23","v":0}]
[{"$f":"'82-samorz.osoba prawna'!A8","v":0},null,null,null,null,{"$f":"'82-samorz.osoba prawna'!L11","v":82},{"$f":"'82-samorz.osoba prawna'!K8","v":0},{"$f":"'82-samorz.osoba prawna'!H8","v":4},{"$f":"'82-samorz.osoba prawna'!M11","v":0},null,null,{"$f":"'82-samorz.osoba prawna'!C19","v":0},{"$f":"'82-samorz.osoba prawna'!D19","v":0},{"$f":"'82-samorz.osoba prawna'!E19","v":0},{"$f":"'82-samorz.osoba prawna'!F19","v":0},{"$f":"'82-samorz.osoba prawna'!G19","v":0},{"$f":"'82-samorz.osoba prawna'!H19","v":0},{"$f":"'82-samorz.osoba prawna'!I19","v":0},{"$f":"'82-samorz.osoba prawna'!C20","v":0},{"$f":"'82-samorz.osoba prawna'!D20","v":0},{"$f":"'82-samorz.osoba prawna'!E20","v":0},{"$f":"'82-samorz.osoba prawna'!F20","v":0},{"$f":"'82-samorz.osoba prawna'!G20","v":0},{"$f":"'82-samorz.osoba prawna'!H20","v":0},{"$f":"'82-samorz.osoba prawna'!I20","v":0},{"$f":"'82-samorz.osoba prawna'!C21","v":0},{"$f":"'82-samorz.osoba prawna'!D21","v":0},{"$f":"'82-samorz.osoba prawna'!E21","v":0},{"$f":"'82-samorz.osoba prawna'!F21","v":0},{"$f":"'82-samorz.osoba prawna'!G21","v":0},{"$f":"'82-samorz.osoba prawna'!H21","v":0},{"$f":"'82-samorz.osoba prawna'!I21","v":0},{"$f":"'82-samorz.osoba prawna'!C22","v":0},{"$f":"'82-samorz.osoba prawna'!D22","v":0},{"$f":"'82-samorz.osoba prawna'!E22","v":0},{"$f":"'82-samorz.osoba prawna'!F22","v":0},{"$f":"'82-samorz.osoba prawna'!G22","v":0},{"$f":"'82-samorz.osoba prawna'!H22","v":0},{"$f":"'82-samorz.osoba prawna'!I22","v":0},{"$f":"'82-samorz.osoba prawna'!C23","v":0},{"$f":"'82-samorz.osoba prawna'!D23","v":0},{"$f":"'82-samorz.osoba prawna'!E23","v":0},{"$f":"'82-samorz.osoba prawna'!F23","v":0},{"$f":"'82-samorz.osoba prawna'!G23","v":0},{"$f":"'82-samorz.osoba prawna'!H23","v":0},{"$f":"'82-samorz.osoba prawna'!I23","v":0}]
[{"$f":"'90-agencja wykonawcza'!A8","v":0},null,null,null,null,{"$f":"'90-agencja wykonawcza'!L11","v":90},{"$f":"'90-agencja wykonawcza'!K8","v":0},{"$f":"'90-agencja wykonawcza'!H8","v":4},{"$f":"'90-agencja wykonawcza'!M11","v":0},null,null,{"$f":"'90-agencja wykonawcza'!C19","v":0},{"$f":"'90-agencja wykonawcza'!D19","v":0},{"$f":"'90-agencja wykonawcza'!E19","v":0},{"$f":"'90-agencja wykonawcza'!F19","v":0},{"$f":"'90-agencja wykonawcza'!G19","v":0},{"$f":"'90-agencja wykonawcza'!H19","v":0},{"$f":"'90-agencja wykonawcza'!I19","v":0},{"$f":"'90-agencja wykonawcza'!C20","v":0},{"$f":"'90-agencja wykonawcza'!D20","v":0},{"$f":"'90-agencja wykonawcza'!E20","v":0},{"$f":"'90-agencja wykonawcza'!F20","v":0},{"$f":"'90-agencja wykonawcza'!G20","v":0},{"$f":"'90-agencja wykonawcza'!H20","v":0},{"$f":"'90-agencja wykonawcza'!I20","v":0},{"$f":"'90-agencja wykonawcza'!C21","v":0},{"$f":"'90-agencja wykonawcza'!D21","v":0},{"$f":"'90-agencja wykonawcza'!E21","v":0},{"$f":"'90-agencja wykonawcza'!F21","v":0},{"$f":"'90-agencja wykonawcza'!G21","v":0},{"$f":"'90-agencja wykonawcza'!H21","v":0},{"$f":"'90-agencja wykonawcza'!I21","v":0},{"$f":"'90-agencja wykonawcza'!C22","v":0},{"$f":"'90-agencja wykonawcza'!D22","v":0},{"$f":"'90-agencja wykonawcza'!E22","v":0},{"$f":"'90-agencja wykonawcza'!F22","v":0},{"$f":"'90-agencja wykonawcza'!G22","v":0},{"$f":"'90-agencja wykonawcza'!H22","v":0},{"$f":"'90-agencja wykonawcza'!I22","v":0},{"$f":"'90-agencja wykonawcza'!C23","v":0},{"$f":"'90-agencja wykonawcza'!D23","v":0},{"$f":"'90-agencja wykonawcza'!E23","v":0},{"$f":"'90-agencja wykonawcza'!F23","v":0},{"$f":"'90-agencja wykonawcza'!G23","v":0},{"$f":"'90-agencja wykonawcza'!H23","v":0},{"$f":"'90-agencja wykonawcza'!I23","v":0}]
[{"$f":"'99-zbiorczo'!A8","v":"Brak nr REGON"},null,null,null,null,{"$f":"'99-zbiorczo'!L11","v":99},{"$f":"'99-zbiorczo'!K8","v":"Brak roku"},{"$f":"'99-zbiorczo'!H8","v":4},{"$f":"'99-zbiorczo'!M11","v":0},null,null,{"$f":"'99-zbiorczo'!C19","v":0},{"$f":"'99-zbiorczo'!D19","v":0},{"$f":"'99-zbiorczo'!E19","v":0},{"$f":"'99-zbiorczo'!F19","v":0},{"$f":"'99-zbiorczo'!G19","v":0},{"$f":"'99-zbiorczo'!H19","v":0},{"$f":"'99-zbiorczo'!I19","v":0},{"$f":"'99-zbiorczo'!C20","v":0},{"$f":"'99-zbiorczo'!D20","v":0},{"$f":"'99-zbiorczo'!E20","v":0},{"$f":"'99-zbiorczo'!F20","v":0},{"$f":"'99-zbiorczo'!G20","v":0},{"$f":"'99-zbiorczo'!H20","v":0},{"$f":"'99-zbiorczo'!I20","v":0},{"$f":"'99-zbiorczo'!C21","v":0},{"$f":"'99-zbiorczo'!D21","v":0},{"$f":"'99-zbiorczo'!E21","v":0},{"$f":"'99-zbiorczo'!F21","v":0},{"$f":"'99-zbiorczo'!G21","v":0},{"$f":"'99-zbiorczo'!H21","v":0},{"$f":"'99-zbiorczo'!I21","v":0},{"$f":"'99-zbiorczo'!C22","v":0},{"$f":"'99-zbiorczo'!D22","v":0},{"$f":"'99-zbiorczo'!E22","v":0},{"$f":"'99-zbiorczo'!F22","v":0},{"$f":"'99-zbiorczo'!G22","v":0},{"$f":"'99-zbiorczo'!H22","v":0},{"$f":"'99-zbiorczo'!I22","v":0},{"$f":"'99-zbiorczo'!C23","v":0},{"$f":"'99-zbiorczo'!D23","v":0},{"$f":"'99-zbiorczo'!E23","v":0},{"$f":"'99-zbiorczo'!F23","v":0},{"$f":"'99-zbiorczo'!G23","v":0},{"$f":"'99-zbiorczo'!H23","v":0},{"$f":"'99-zbiorczo'!I23","v":0}]

{"sheet":"RBUZB1","index":17,"n_rows":17,"n_cols":63,"rows_kept":17,"cut":false,"hidden":true,"merged":[]}
["REGON","WK","PK","GK","GT","PT","ROK","KWARTAL","CZ_BU","DAT_SKW","UWAGI","B10102","B10103","B10104","B10105","B10202","B10203","B10204","B10205","B10302","B10303","B10304","B10305","B10402","B10403","B10404","B10405","B10502","B10503","B10504","B10505","B10602","B10603","B10604","B10605","B10702","B10703","B10704","B10705","B10802","B10803","B10804","B10805","B10902","B10903","B10904","B10905","B11002","B11003","B11004","B11005","B11102","B11103","B11104","B11105","B11202","B11203","B11204","B11205","B11302","B11303","B11304","B11305"]
[{"$f":"'11-państw.fund.cel.'!A8","v":0},null,null,null,null,{"$f":"'11-państw.fund.cel.'!L11","v":11},{"$f":"'11-państw.fund.cel.'!K8","v":0},{"$f":"'11-państw.fund.cel.'!H8","v":4},{"$f":"'11-państw.fund.cel.'!M11","v":0},null,null,{"$f":"'11-państw.fund.cel.'!D33","v":0},{"$f":"'11-państw.fund.cel.'!E33","v":0},{"$f":"'11-państw.fund.cel.'!F33","v":0},{"$f":"'11-państw.fund.cel.'!G33","v":0},{"$f":"'11-państw.fund.cel.'!D34","v":0},{"$f":"'11-państw.fund.cel.'!E34","v":0},{"$f":"'11-państw.fund.cel.'!F34","v":0},{"$f":"'11-państw.fund.cel.'!G34","v":0},{"$f":"'11-państw.fund.cel.'!D35","v":0},{"$f":"'11-państw.fund.cel.'!E35","v":0},{"$f":"'11-państw.fund.cel.'!F35","v":0},{"$f":"'11-państw.fund.cel.'!G35","v":0},{"$f":"'11-państw.fund.cel.'!D36","v":0},{"$f":"'11-państw.fund.cel.'!E36","v":0},{"$f":"'11-państw.fund.cel.'!F36","v":0},{"$f":"'11-państw.fund.cel.'!G36","v":0},{"$f":"'11-państw.fund.cel.'!D37","v":0},{"$f":"'11-państw.fund.cel.'!E37","v":0},{"$f":"'11-państw.fund.cel.'!F37","v":0},{"$f":"'11-państw.fund.cel.'!G37","v":0},{"$f":"'11-państw.fund.cel.'!D38","v":0},{"$f":"'11-państw.fund.cel.'!E38","v":0},{"$f":"'11-państw.fund.cel.'!F38","v":0},{"$f":"'11-państw.fund.cel.'!G38","v":0},{"$f":"'11-państw.fund.cel.'!D39","v":0},{"$f":"'11-państw.fund.cel.'!E39","v":0},{"$f":"'11-państw.fund.cel.'!F39","v":0},{"$f":"'11-państw.fund.cel.'!G39","v":0},{"$f":"'11-państw.fund.cel.'!D40","v":0},{"$f":"'11-państw.fund.cel.'!E40","v":0},{"$f":"'11-państw.fund.cel.'!F40","v":0},{"$f":"'11-państw.fund.cel.'!G40","v":0},{"$f":"'11-państw.fund.cel.'!D41","v":0},{"$f":"'11-państw.fund.cel.'!E41","v":0},{"$f":"'11-państw.fund.cel.'!F41","v":0},{"$f":"'11-państw.fund.cel.'!G41","v":0},{"$f":"'11-państw.fund.cel.'!D42","v":0},{"$f":"'11-państw.fund.cel.'!E42","v":0},{"$f":"'11-państw.fund.cel.'!F42","v":0},{"$f":"'11-państw.fund.cel.'!G42","v":0},{"$f":"'11-państw.fund.cel.'!D43","v":0},{"$f":"'11-państw.fund.cel.'!E43","v":0},{"$f":"'11-państw.fund.cel.'!F43","v":0},{"$f":"'11-państw.fund.cel.'!G43","v":0},{"$f":"'11-państw.fund.cel.'!D44","v":0},{"$f":"'11-państw.fund.cel.'!E44","v":0},{"$f":"'11-państw.fund.cel.'!F44","v":0},{"$f":"'11-państw.fund.cel.'!G44","v":0},{"$f":"'11-państw.fund.cel.'!D45","v":0},{"$f":"'11-państw.fund.cel.'!E45","v":0},{"$f":"'11-państw.fund.cel.'!F45","v":0},{"$f":"'11-państw.fund.cel.'!G45","v":0}]
[{"$f":"'20-państw.szk.wyż.'!A8","v":0},null,null,null,null,{"$f":"'20-państw.szk.wyż.'!L11","v":20},{"$f":"'20-państw.szk.wyż.'!K8","v":0},{"$f":"'20-państw.szk.wyż.'!H8","v":4},{"$f":"'20-państw.szk.wyż.'!M11","v":0},null,null,{"$f":"'20-państw.szk.wyż.'!D33","v":0},{"$f":"'20-państw.szk.wyż.'!E33","v":0},{"$f":"'20-państw.szk.wyż.'!F33","v":0},{"$f":"'20-państw.szk.wyż.'!G33","v":0},{"$f":"'20-państw.szk.wyż.'!D34","v":0},{"$f":"'20-państw.szk.wyż.'!E34","v":0},{"$f":"'20-państw.szk.wyż.'!F34","v":0},{"$f":"'20-państw.szk.wyż.'!G34","v":0},{"$f":"'20-państw.szk.wyż.'!D35","v":0},{"$f":"'20-państw.szk.wyż.'!E35","v":0},{"$f":"'20-państw.szk.wyż.'!F35","v":0},{"$f":"'20-państw.szk.wyż.'!G35","v":0},{"$f":"'20-państw.szk.wyż.'!D36","v":0},{"$f":"'20-państw.szk.wyż.'!E36","v":0},{"$f":"'20-państw.szk.wyż.'!F36","v":0},{"$f":"'20-państw.szk.wyż.'!G36","v":0},{"$f":"'20-państw.szk.wyż.'!D37","v":0},{"$f":"'20-państw.szk.wyż.'!E37","v":0},{"$f":"'20-państw.szk.wyż.'!F37","v":0},{"$f":"'20-państw.szk.wyż.'!G37","v":0},{"$f":"'20-państw.szk.wyż.'!D38","v":0},{"$f":"'20-państw.szk.wyż.'!E38","v":0},{"$f":"'20-państw.szk.wyż.'!F38","v":0},{"$f":"'20-państw.szk.wyż.'!G38","v":0},{"$f":"'20-państw.szk.wyż.'!D39","v":0},{"$f":"'20-państw.szk.wyż.'!E39","v":0},{"$f":"'20-państw.szk.wyż.'!F39","v":0},{"$f":"'20-państw.szk.wyż.'!G39","v":0},{"$f":"'20-państw.szk.wyż.'!D40","v":0},{"$f":"'20-państw.szk.wyż.'!E40","v":0},{"$f":"'20-państw.szk.wyż.'!F40","v":0},{"$f":"'20-państw.szk.wyż.'!G40","v":0},{"$f":"'20-państw.szk.wyż.'!D41","v":0},{"$f":"'20-państw.szk.wyż.'!E41","v":0},{"$f":"'20-państw.szk.wyż.'!F41","v":0},{"$f":"'20-państw.szk.wyż.'!G41","v":0},{"$f":"'20-państw.szk.wyż.'!D42","v":0},{"$f":"'20-państw.szk.wyż.'!E42","v":0},{"$f":"'20-państw.szk.wyż.'!F42","v":0},{"$f":"'20-państw.szk.wyż.'!G42","v":0},{"$f":"'20-państw.szk.wyż.'!D43","v":0},{"$f":"'20-państw.szk.wyż.'!E43","v":0},{"$f":"'20-państw.szk.wyż.'!F43","v":0},{"$f":"'20-państw.szk.wyż.'!G43","v":0},{"$f":"'20-państw.szk.wyż.'!D44","v":0},{"$f":"'20-państw.szk.wyż.'!E44","v":0},{"$f":"'20-państw.szk.wyż.'!F44","v":0},{"$f":"'20-państw.szk.wyż.'!G44","v":0},{"$f":"'20-państw.szk.wyż.'!D45","v":0},{"$f":"'20-państw.szk.wyż.'!E45","v":0},{"$f":"'20-państw.szk.wyż.'!F45","v":0},{"$f":"'20-państw.szk.wyż.'!G45","v":0}]
[{"$f":"'31-instytucje gosp budż'!A8","v":0},null,null,null,null,{"$f":"'31-instytucje gosp budż'!L11","v":31},{"$f":"'31-instytucje gosp budż'!K8","v":0},{"$f":"'31-instytucje gosp budż'!H8","v":4},{"$f":"'31-instytucje gosp budż'!M11","v":0},null,null,{"$f":"'31-instytucje gosp budż'!D33","v":0},{"$f":"'31-instytucje gosp budż'!E33","v":0},{"$f":"'31-instytucje gosp budż'!F33","v":0},{"$f":"'31-instytucje gosp budż'!G33","v":0},{"$f":"'31-instytucje gosp budż'!D34","v":0},{"$f":"'31-instytucje gosp budż'!E34","v":0},{"$f":"'31-instytucje gosp budż'!F34","v":0},{"$f":"'31-instytucje gosp budż'!G34","v":0},{"$f":"'31-instytucje gosp budż'!D35","v":0},{"$f":"'31-instytucje gosp budż'!E35","v":0},{"$f":"'31-instytucje gosp budż'!F35","v":0},{"$f":"'31-instytucje gosp budż'!G35","v":0},{"$f":"'31-instytucje gosp budż'!D36","v":0},{"$f":"'31-instytucje gosp budż'!E36","v":0},{"$f":"'31-instytucje gosp budż'!F36","v":0},{"$f":"'31-instytucje gosp budż'!G36","v":0},{"$f":"'31-instytucje gosp budż'!D37","v":0},{"$f":"'31-instytucje gosp budż'!E37","v":0},{"$f":"'31-instytucje gosp budż'!F37","v":0},{"$f":"'31-instytucje gosp budż'!G37","v":0},{"$f":"'31-instytucje gosp budż'!D38","v":0},{"$f":"'31-instytucje gosp budż'!E38","v":0},{"$f":"'31-instytucje gosp budż'!F38","v":0},{"$f":"'31-instytucje gosp budż'!G38","v":0},{"$f":"'31-instytucje gosp budż'!D39","v":0},{"$f":"'31-instytucje gosp budż'!E39","v":0},{"$f":"'31-instytucje gosp budż'!F39","v":0},{"$f":"'31-instytucje gosp budż'!G39","v":0},{"$f":"'31-instytucje gosp budż'!D40","v":0},{"$f":"'31-instytucje gosp budż'!E40","v":0},{"$f":"'31-instytucje gosp budż'!F40","v":0},{"$f":"'31-instytucje gosp budż'!G40","v":0},{"$f":"'31-instytucje gosp budż'!D41","v":0},{"$f":"'31-instytucje gosp budż'!E41","v":0},{"$f":"'31-instytucje gosp budż'!F41","v":0},{"$f":"'31-instytucje gosp budż'!G41","v":0},{"$f":"'31-instytucje gosp budż'!D42","v":0},{"$f":"'31-instytucje gosp budż'!E42","v":0},{"$f":"'31-instytucje gosp budż'!F42","v":0},{"$f":"'31-instytucje gosp budż'!G42","v":0},{"$f":"'31-instytucje gosp budż'!D43","v":0},{"$f":"'31-instytucje gosp budż'!E43","v":0},{"$f":"'31-instytucje gosp budż'!F43","v":0},{"$f":"'31-instytucje gosp budż'!G43","v":0},{"$f":"'31-instytucje gosp budż'!D44","v":0},{"$f":"'31-instytucje gosp budż'!E44","v":0},{"$f":"'31-instytucje gosp budż'!F44","v":0},{"$f":"'31-instytucje gosp budż'!G44","v":0},{"$f":"'31-instytucje gosp budż'!D45","v":0},{"$f":"'31-instytucje gosp budż'!E45","v":0},{"$f":"'31-instytucje gosp budż'!F45","v":0},{"$f":"'31-instytucje gosp budż'!G45","v":0}]
[{"$f":"'41-państw.inst.kult.'!A8","v":0},null,null,null,null,{"$f":"'41-państw.inst.kult.'!L11","v":41},{"$f":"'41-państw.inst.kult.'!K8","v":0},{"$f":"'41-państw.inst.kult.'!H8","v":4},{"$f":"'41-państw.inst.kult.'!M11","v":0},null,null,{"$f":"'41-państw.inst.kult.'!D33","v":0},{"$f":"'41-państw.inst.kult.'!E33","v":0},{"$f":"'41-państw.inst.kult.'!F33","v":0},{"$f":"'41-państw.inst.kult.'!G33","v":0},{"$f":"'41-państw.inst.kult.'!D34","v":0},{"$f":"'41-państw.inst.kult.'!E34","v":0},{"$f":"'41-państw.inst.kult.'!F34","v":0},{"$f":"'41-państw.inst.kult.'!G34","v":0},{"$f":"'41-państw.inst.kult.'!D35","v":0},{"$f":"'41-państw.inst.kult.'!E35","v":0},{"$f":"'41-państw.inst.kult.'!F35","v":0},{"$f":"'41-państw.inst.kult.'!G35","v":0},{"$f":"'41-państw.inst.kult.'!D36","v":0},{"$f":"'41-państw.inst.kult.'!E36","v":0},{"$f":"'41-państw.inst.kult.'!F36","v":0},{"$f":"'41-państw.inst.kult.'!G36","v":0},{"$f":"'41-państw.inst.kult.'!D37","v":0},{"$f":"'41-państw.inst.kult.'!E37","v":0},{"$f":"'41-państw.inst.kult.'!F37","v":0},{"$f":"'41-państw.inst.kult.'!G37","v":0},{"$f":"'41-państw.inst.kult.'!D38","v":0},{"$f":"'41-państw.inst.kult.'!E38","v":0},{"$f":"'41-państw.inst.kult.'!F38","v":0},{"$f":"'41-państw.inst.kult.'!G38","v":0},{"$f":"'41-państw.inst.kult.'!D39","v":0},{"$f":"'41-państw.inst.kult.'!E39","v":0},{"$f":"'41-państw.inst.kult.'!F39","v":0},{"$f":"'41-państw.inst.kult.'!G39","v":0},{"$f":"'41-państw.inst.kult.'!D40","v":0},{"$f":"'41-państw.inst.kult.'!E40","v":0},{"$f":"'41-państw.inst.kult.'!F40","v":0},{"$f":"'41-państw.inst.kult.'!G40","v":0},{"$f":"'41-państw.inst.kult.'!D41","v":0},{"$f":"'41-państw.inst.kult.'!E41","v":0},{"$f":"'41-państw.inst.kult.'!F41","v":0},{"$f":"'41-państw.inst.kult.'!G41","v":0},{"$f":"'41-państw.inst.kult.'!D42","v":0},{"$f":"'41-państw.inst.kult.'!E42","v":0},{"$f":"'41-państw.inst.kult.'!F42","v":0},{"$f":"'41-państw.inst.kult.'!G42","v":0},{"$f":"'41-państw.inst.kult.'!D43","v":0},{"$f":"'41-państw.inst.kult.'!E43","v":0},{"$f":"'41-państw.inst.kult.'!F43","v":0},{"$f":"'41-państw.inst.kult.'!G43","v":0},{"$f":"'41-państw.inst.kult.'!D44","v":0},{"$f":"'41-państw.inst.kult.'!E44","v":0},{"$f":"'41-państw.inst.kult.'!F44","v":0},{"$f":"'41-państw.inst.kult.'!G44","v":0},{"$f":"'41-państw.inst.kult.'!D45","v":0},{"$f":"'41-państw.inst.kult.'!E45","v":0},{"$f":"'41-państw.inst.kult.'!F45","v":0},{"$f":"'41-państw.inst.kult.'!G45","v":0}]
[{"$f":"'42-samorz.inst.kult.'!A8","v":0},null,null,null,null,{"$f":"'42-samorz.inst.kult.'!L11","v":42},{"$f":"'42-samorz.inst.kult.'!K8","v":0},{"$f":"'42-samorz.inst.kult.'!H8","v":4},{"$f":"'42-samorz.inst.kult.'!M11","v":0},null,null,{"$f":"'42-samorz.inst.kult.'!D33","v":0},{"$f":"'42-samorz.inst.kult.'!E33","v":0},{"$f":"'42-samorz.inst.kult.'!F33","v":0},{"$f":"'42-samorz.inst.kult.'!G33","v":0},{"$f":"'42-samorz.inst.kult.'!D34","v":0},{"$f":"'42-samorz.inst.kult.'!E34","v":0},{"$f":"'42-samorz.inst.kult.'!F34","v":0},{"$f":"'42-samorz.inst.kult.'!G34","v":0},{"$f":"'42-samorz.inst.kult.'!D35","v":0},{"$f":"'42-samorz.inst.kult.'!E35","v":0},{"$f":"'42-samorz.inst.kult.'!F35","v":0},{"$f":"'42-samorz.inst.kult.'!G35","v":0},{"$f":"'42-samorz.inst.kult.'!D36","v":0},{"$f":"'42-samorz.inst.kult.'!E36","v":0},{"$f":"'42-samorz.inst.kult.'!F36","v":0},{"$f":"'42-samorz.inst.kult.'!G36","v":0},{"$f":"'42-samorz.inst.kult.'!D37","v":0},{"$f":"'42-samorz.inst.kult.'!E37","v":0},{"$f":"'42-samorz.inst.kult.'!F37","v":0},{"$f":"'42-samorz.inst.kult.'!G37","v":0},{"$f":"'42-samorz.inst.kult.'!D38","v":0},{"$f":"'42-samorz.inst.kult.'!E38","v":0},{"$f":"'42-samorz.inst.kult.'!F38","v":0},{"$f":"'42-samorz.inst.kult.'!G38","v":0},{"$f":"'42-samorz.inst.kult.'!D39","v":0},{"$f":"'42-samorz.inst.kult.'!E39","v":0},{"$f":"'42-samorz.inst.kult.'!F39","v":0},{"$f":"'42-samorz.inst.kult.'!G39","v":0},{"$f":"'42-samorz.inst.kult.'!D40","v":0},{"$f":"'42-samorz.inst.kult.'!E40","v":0},{"$f":"'42-samorz.inst.kult.'!F40","v":0},{"$f":"'42-samorz.inst.kult.'!G40","v":0},{"$f":"'42-samorz.inst.kult.'!D41","v":0},{"$f":"'42-samorz.inst.kult.'!E41","v":0},{"$f":"'42-samorz.inst.kult.'!F41","v":0},{"$f":"'42-samorz.inst.kult.'!G41","v":0},{"$f":"'42-samorz.inst.kult.'!D42","v":0},{"$f":"'42-samorz.inst.kult.'!E42","v":0},{"$f":"'42-samorz.inst.kult.'!F42","v":0},{"$f":"'42-samorz.inst.kult.'!G42","v":0},{"$f":"'42-samorz.inst.kult.'!D43","v":0},{"$f":"'42-samorz.inst.kult.'!E43","v":0},{"$f":"'42-samorz.inst.kult.'!F43","v":0},{"$f":"'42-samorz.inst.kult.'!G43","v":0},{"$f":"'42-samorz.inst.kult.'!D44","v":0},{"$f":"'42-samorz.inst.kult.'!E44","v":0},{"$f":"'42-samorz.inst.kult.'!F44","v":0},{"$f":"'42-samorz.inst.kult.'!G44","v":0},{"$f":"'42-samorz.inst.kult.'!D45","v":0},{"$f":"'42-samorz.inst.kult.'!E45","v":0},{"$f":"'42-samorz.inst.kult.'!F45","v":0},{"$f":"'42-samorz.inst.kult.'!G45","v":0}]
[{"$f":"'50-PAN i jedn.tworz.przez PAN'!A8","v":0},null,null,null,null,{"$f":"'50-PAN i jedn.tworz.przez PAN'!L11","v":50},{"$f":"'50-PAN i jedn.tworz.przez PAN'!K8","v":0},{"$f":"'50-PAN i jedn.tworz.przez PAN'!H8","v":4},{"$f":"'50-PAN i jedn.tworz.przez PAN'!M11","v":0},null,null,{"$f":"'50-PAN i jedn.tworz.przez PAN'!D33","v":0},{"$f":"'50-PAN i jedn.tworz.przez PAN'!E33","v":0},{"$f":"'50-PAN i jedn.tworz.przez PAN'!F33","v":0},{"$f":"'50-PAN i jedn.tworz.przez PAN'!G33","v":0},{"$f":"'50-PAN i jedn.tworz.przez PAN'!D34","v":0},{"$f":"'50-PAN i jedn.tworz.przez PAN'!E34","v":0},{"$f":"'50-PAN i jedn.tworz.przez PAN'!F34","v":0},{"$f":"'50-PAN i jedn.tworz.przez PAN'!G34","v":0},{"$f":"'50-PAN i jedn.tworz.przez PAN'!D35","v":0},{"$f":"'50-PAN i jedn.tworz.przez PAN'!E35","v":0},{"$f":"'50-PAN i jedn.tworz.przez PAN'!F35","v":0},{"$f":"'50-PAN i jedn.tworz.przez PAN'!G35","v":0},{"$f":"'50-PAN i jedn.tworz.przez PAN'!D36","v":0},{"$f":"'50-PAN i jedn.tworz.przez PAN'!E36","v":0},{"$f":"'50-PAN i jedn.tworz.przez PAN'!F36","v":0},{"$f":"'50-PAN i jedn.tworz.przez PAN'!G36","v":0},{"$f":"'50-PAN i jedn.tworz.przez PAN'!D37","v":0},{"$f":"'50-PAN i jedn.tworz.przez PAN'!E37","v":0},{"$f":"'50-PAN i jedn.tworz.przez PAN'!F37","v":0},{"$f":"'50-PAN i jedn.tworz.przez PAN'!G37","v":0},{"$f":"'50-PAN i jedn.tworz.przez PAN'!D38","v":0},{"$f":"'50-PAN i jedn.tworz.przez PAN'!E38","v":0},{"$f":"'50-PAN i jedn.tworz.przez PAN'!F38","v":0},{"$f":"'50-PAN i jedn.tworz.przez PAN'!G38","v":0},{"$f":"'50-PAN i jedn.tworz.przez PAN'!D39","v":0},{"$f":"'50-PAN i jedn.tworz.przez PAN'!E39","v":0},{"$f":"'50-PAN i jedn.tworz.przez PAN'!F39","v":0},{"$f":"'50-PAN i jedn.tworz.przez PAN'!G39","v":0},{"$f":"'50-PAN i jedn.tworz.przez PAN'!D40","v":0},{"$f":"'50-PAN i jedn.tworz.przez PAN'!E40","v":0},{"$f":"'50-PAN i jedn.tworz.przez PAN'!F40","v":0},{"$f":"'50-PAN i jedn.tworz.przez PAN'!G40","v":0},{"$f":"'50-PAN i jedn.tworz.przez PAN'!D41","v":0},{"$f":"'50-PAN i jedn.tworz.przez PAN'!E41","v":0},{"$f":"'50-PAN i jedn.tworz.przez PAN'!F41","v":0},{"$f":"'50-PAN i jedn.tworz.przez PAN'!G41","v":0},{"$f":"'50-PAN i jedn.tworz.przez PAN'!D42","v":0},{"$f":"'50-PAN i jedn.tworz.przez PAN'!E42","v":0},{"$f":"'50-PAN i jedn.tworz.przez PAN'!F42","v":0},{"$f":"'50-PAN i jedn.tworz.przez PAN'!G42","v":0},{"$f":"'50-PAN i jedn.tworz.przez PAN'!D43","v":0},{"$f":"'50-PAN i jedn.tworz.przez PAN'!E43","v":0},{"$f":"'50-PAN i jedn.tworz.przez PAN'!F43","v":0},{"$f":"'50-PAN i jedn.tworz.przez PAN'!G43","v":0},{"$f":"'50-PAN i jedn.tworz.przez PAN'!D44","v":0},{"$f":"'50-PAN i jedn.tworz.przez PAN'!E44","v":0},{"$f":"'50-PAN i jedn.tworz.przez PAN'!F44","v":0},{"$f":"'50-PAN i jedn.tworz.przez PAN'!G44","v":0},{"$f":"'50-PAN i jedn.tworz.przez PAN'!D45","v":0},{"$f":"'50-PAN i jedn.tworz.przez PAN'!E45","v":0},{"$f":"'50-PAN i jedn.tworz.przez PAN'!F45","v":0},{"$f":"'50-PAN i jedn.tworz.przez PAN'!G45","v":0}]
[{"$f":"'61-samodz.publ.ZOZ państw.'!A8","v":0},null,null,null,null,{"$f":"'61-samodz.publ.ZOZ państw.'!L11","v":61},{"$f":"'61-samodz.publ.ZOZ państw.'!K8","v":0},{"$f":"'61-samodz.publ.ZOZ państw.'!H8","v":4},{"$f":"'61-samodz.publ.ZOZ państw.'!M11","v":0},null,null,{"$f":"'61-samodz.publ.ZOZ państw.'!D33","v":0},{"$f":"'61-samodz.publ.ZOZ państw.'!E33","v":0},{"$f":"'61-samodz.publ.ZOZ państw.'!F33","v":0},{"$f":"'61-samodz.publ.ZOZ państw.'!G33","v":0},{"$f":"'61-samodz.publ.ZOZ państw.'!D34","v":0},{"$f":"'61-samodz.publ.ZOZ państw.'!E34","v":0},{"$f":"'61-samodz.publ.ZOZ państw.'!F34","v":0},{"$f":"'61-samodz.publ.ZOZ państw.'!G34","v":0},{"$f":"'61-samodz.publ.ZOZ państw.'!D35","v":0},{"$f":"'61-samodz.publ.ZOZ państw.'!E35","v":0},{"$f":"'61-samodz.publ.ZOZ państw.'!F35","v":0},{"$f":"'61-samodz.publ.ZOZ państw.'!G35","v":0},{"$f":"'61-samodz.publ.ZOZ państw.'!D36","v":0},{"$f":"'61-samodz.publ.ZOZ państw.'!E36","v":0},{"$f":"'61-samodz.publ.ZOZ państw.'!F36","v":0},{"$f":"'61-samodz.publ.ZOZ państw.'!G36","v":0},{"$f":"'61-samodz.publ.ZOZ państw.'!D37","v":0},{"$f":"'61-samodz.publ.ZOZ państw.'!E37","v":0},{"$f":"'61-samodz.publ.ZOZ państw.'!F37","v":0},{"$f":"'61-samodz.publ.ZOZ państw.'!G37","v":0},{"$f":"'61-samodz.publ.ZOZ państw.'!D38","v":0},{"$f":"'61-samodz.publ.ZOZ państw.'!E38","v":0},{"$f":"'61-samodz.publ.ZOZ państw.'!F38","v":0},{"$f":"'61-samodz.publ.ZOZ państw.'!G38","v":0},{"$f":"'61-samodz.publ.ZOZ państw.'!D39","v":0},{"$f":"'61-samodz.publ.ZOZ państw.'!E39","v":0},{"$f":"'61-samodz.publ.ZOZ państw.'!F39","v":0},{"$f":"'61-samodz.publ.ZOZ państw.'!G39","v":0},{"$f":"'61-samodz.publ.ZOZ państw.'!D40","v":0},{"$f":"'61-samodz.publ.ZOZ państw.'!E40","v":0},{"$f":"'61-samodz.publ.ZOZ państw.'!F40","v":0},{"$f":"'61-samodz.publ.ZOZ państw.'!G40","v":0},{"$f":"'61-samodz.publ.ZOZ państw.'!D41","v":0},{"$f":"'61-samodz.publ.ZOZ państw.'!E41","v":0},{"$f":"'61-samodz.publ.ZOZ państw.'!F41","v":0},{"$f":"'61-samodz.publ.ZOZ państw.'!G41","v":0},{"$f":"'61-samodz.publ.ZOZ państw.'!D42","v":0},{"$f":"'61-samodz.publ.ZOZ państw.'!E42","v":0},{"$f":"'61-samodz.publ.ZOZ państw.'!F42","v":0},{"$f":"'61-samodz.publ.ZOZ państw.'!G42","v":0},{"$f":"'61-samodz.publ.ZOZ państw.'!D43","v":0},{"$f":"'61-samodz.publ.ZOZ państw.'!E43","v":0},{"$f":"'61-samodz.publ.ZOZ państw.'!F43","v":0},{"$f":"'61-samodz.publ.ZOZ państw.'!G43","v":0},{"$f":"'61-samodz.publ.ZOZ państw.'!D44","v":0},{"$f":"'61-samodz.publ.ZOZ państw.'!E44","v":0},{"$f":"'61-samodz.publ.ZOZ państw.'!F44","v":0},{"$f":"'61-samodz.publ.ZOZ państw.'!G44","v":0},{"$f":"'61-samodz.publ.ZOZ państw.'!D45","v":0},{"$f":"'61-samodz.publ.ZOZ państw.'!E45","v":0},{"$f":"'61-samodz.publ.ZOZ państw.'!F45","v":0},{"$f":"'61-samodz.publ.ZOZ państw.'!G45","v":0}]
[{"$f":"'62-samodz.publ.ZOZ samorz.'!A8","v":0},null,null,null,null,{"$f":"'62-samodz.publ.ZOZ samorz.'!L11","v":62},{"$f":"'62-samodz.publ.ZOZ samorz.'!K8","v":0},{"$f":"'62-samodz.publ.ZOZ samorz.'!H8","v":4},{"$f":"'62-samodz.publ.ZOZ samorz.'!M11","v":0},null,null,{"$f":"'62-samodz.publ.ZOZ samorz.'!D33","v":0},{"$f":"'62-samodz.publ.ZOZ samorz.'!E33","v":0},{"$f":"'62-samodz.publ.ZOZ samorz.'!F33","v":0},{"$f":"'62-samodz.publ.ZOZ samorz.'!G33","v":0},{"$f":"'62-samodz.publ.ZOZ samorz.'!D34","v":0},{"$f":"'62-samodz.publ.ZOZ samorz.'!E34","v":0},{"$f":"'62-samodz.publ.ZOZ samorz.'!F34","v":0},{"$f":"'62-samodz.publ.ZOZ samorz.'!G34","v":0},{"$f":"'62-samodz.publ.ZOZ samorz.'!D35","v":0},{"$f":"'62-samodz.publ.ZOZ samorz.'!E35","v":0},{"$f":"'62-samodz.publ.ZOZ samorz.'!F35","v":0},{"$f":"'62-samodz.publ.ZOZ samorz.'!G35","v":0},{"$f":"'62-samodz.publ.ZOZ samorz.'!D36","v":0},{"$f":"'62-samodz.publ.ZOZ samorz.'!E36","v":0},{"$f":"'62-samodz.publ.ZOZ samorz.'!F36","v":0},{"$f":"'62-samodz.publ.ZOZ samorz.'!G36","v":0},{"$f":"'62-samodz.publ.ZOZ samorz.'!D37","v":0},{"$f":"'62-samodz.publ.ZOZ samorz.'!E37","v":0},{"$f":"'62-samodz.publ.ZOZ samorz.'!F37","v":0},{"$f":"'62-samodz.publ.ZOZ samorz.'!G37","v":0},{"$f":"'62-samodz.publ.ZOZ samorz.'!D38","v":0},{"$f":"'62-samodz.publ.ZOZ samorz.'!E38","v":0},{"$f":"'62-samodz.publ.ZOZ samorz.'!F38","v":0},{"$f":"'62-samodz.publ.ZOZ samorz.'!G38","v":0},{"$f":"'62-samodz.publ.ZOZ samorz.'!D39","v":0},{"$f":"'62-samodz.publ.ZOZ samorz.'!E39","v":0},{"$f":"'62-samodz.publ.ZOZ samorz.'!F39","v":0},{"$f":"'62-samodz.publ.ZOZ samorz.'!G39","v":0},{"$f":"'62-samodz.publ.ZOZ samorz.'!D40","v":0},{"$f":"'62-samodz.publ.ZOZ samorz.'!E40","v":0},{"$f":"'62-samodz.publ.ZOZ samorz.'!F40","v":0},{"$f":"'62-samodz.publ.ZOZ samorz.'!G40","v":0},{"$f":"'62-samodz.publ.ZOZ samorz.'!D41","v":0},{"$f":"'62-samodz.publ.ZOZ samorz.'!E41","v":0},{"$f":"'62-samodz.publ.ZOZ samorz.'!F41","v":0},{"$f":"'62-samodz.publ.ZOZ samorz.'!G41","v":0},{"$f":"'62-samodz.publ.ZOZ samorz.'!D42","v":0},{"$f":"'62-samodz.publ.ZOZ samorz.'!E42","v":0},{"$f":"'62-samodz.publ.ZOZ samorz.'!F42","v":0},{"$f":"'62-samodz.publ.ZOZ samorz.'!G42","v":0},{"$f":"'62-samodz.publ.ZOZ samorz.'!D43","v":0},{"$f":"'62-samodz.publ.ZOZ samorz.'!E43","v":0},{"$f":"'62-samodz.publ.ZOZ samorz.'!F43","v":0},{"$f":"'62-samodz.publ.ZOZ samorz.'!G43","v":0},{"$f":"'62-samodz.publ.ZOZ samorz.'!D44","v":0},{"$f":"'62-samodz.publ.ZOZ samorz.'!E44","v":0},{"$f":"'62-samodz.publ.ZOZ samorz.'!F44","v":0},{"$f":"'62-samodz.publ.ZOZ samorz.'!G44","v":0},{"$f":"'62-samodz.publ.ZOZ samorz.'!D45","v":0},{"$f":"'62-samodz.publ.ZOZ samorz.'!E45","v":0},{"$f":"'62-samodz.publ.ZOZ samorz.'!F45","v":0},{"$f":"'62-samodz.publ.ZOZ samorz.'!G45","v":0}]
[{"$f":"'63-Narodowy Fundusz Zdrowia'!A8","v":0},null,null,null,null,{"$f":"'63-Narodowy Fundusz Zdrowia'!L11","v":63},{"$f":"'63-Narodowy Fundusz Zdrowia'!K8","v":0},{"$f":"'63-Narodowy Fundusz Zdrowia'!H8","v":4},{"$f":"'63-Narodowy Fundusz Zdrowia'!M11","v":0},null,null,{"$f":"'63-Narodowy Fundusz Zdrowia'!D33","v":0},{"$f":"'63-Narodowy Fundusz Zdrowia'!E33","v":0},{"$f":"'63-Narodowy Fundusz Zdrowia'!F33","v":0},{"$f":"'63-Narodowy Fundusz Zdrowia'!G33","v":0},{"$f":"'63-Narodowy Fundusz Zdrowia'!D34","v":0},{"$f":"'63-Narodowy Fundusz Zdrowia'!E34","v":0},{"$f":"'63-Narodowy Fundusz Zdrowia'!F34","v":0},{"$f":"'63-Narodowy Fundusz Zdrowia'!G34","v":0},{"$f":"'63-Narodowy Fundusz Zdrowia'!D35","v":0},{"$f":"'63-Narodowy Fundusz Zdrowia'!E35","v":0},{"$f":"'63-Narodowy Fundusz Zdrowia'!F35","v":0},{"$f":"'63-Narodowy Fundusz Zdrowia'!G35","v":0},{"$f":"'63-Narodowy Fundusz Zdrowia'!D36","v":0},{"$f":"'63-Narodowy Fundusz Zdrowia'!E36","v":0},{"$f":"'63-Narodowy Fundusz Zdrowia'!F36","v":0},{"$f":"'63-Narodowy Fundusz Zdrowia'!G36","v":0},{"$f":"'63-Narodowy Fundusz Zdrowia'!D37","v":0},{"$f":"'63-Narodowy Fundusz Zdrowia'!E37","v":0},{"$f":"'63-Narodowy Fundusz Zdrowia'!F37","v":0},{"$f":"'63-Narodowy Fundusz Zdrowia'!G37","v":0},{"$f":"'63-Narodowy Fundusz Zdrowia'!D38","v":0},{"$f":"'63-Narodowy Fundusz Zdrowia'!E38","v":0},{"$f":"'63-Narodowy Fundusz Zdrowia'!F38","v":0},{"$f":"'63-Narodowy Fundusz Zdrowia'!G38","v":0},{"$f":"'63-Narodowy Fundusz Zdrowia'!D39","v":0},{"$f":"'63-Narodowy Fundusz Zdrowia'!E39","v":0},{"$f":"'63-Narodowy Fundusz Zdrowia'!F39","v":0},{"$f":"'63-Narodowy Fundusz Zdrowia'!G39","v":0},{"$f":"'63-Narodowy Fundusz Zdrowia'!D40","v":0},{"$f":"'63-Narodowy Fundusz Zdrowia'!E40","v":0},{"$f":"'63-Narodowy Fundusz Zdrowia'!F40","v":0},{"$f":"'63-Narodowy Fundusz Zdrowia'!G40","v":0},{"$f":"'63-Narodowy Fundusz Zdrowia'!D41","v":0},{"$f":"'63-Narodowy Fundusz Zdrowia'!E41","v":0},{"$f":"'63-Narodowy Fundusz Zdrowia'!F41","v":0},{"$f":"'63-Narodowy Fundusz Zdrowia'!G41","v":0},{"$f":"'63-Narodowy Fundusz Zdrowia'!D42","v":0},{"$f":"'63-Narodowy Fundusz Zdrowia'!E42","v":0},{"$f":"'63-Narodowy Fundusz Zdrowia'!F42","v":0},{"$f":"'63-Narodowy Fundusz Zdrowia'!G42","v":0},{"$f":"'63-Narodowy Fundusz Zdrowia'!D43","v":0},{"$f":"'63-Narodowy Fundusz Zdrowia'!E43","v":0},{"$f":"'63-Narodowy Fundusz Zdrowia'!F43","v":0},{"$f":"'63-Narodowy Fundusz Zdrowia'!G43","v":0},{"$f":"'63-Narodowy Fundusz Zdrowia'!D44","v":0},{"$f":"'63-Narodowy Fundusz Zdrowia'!E44","v":0},{"$f":"'63-Narodowy Fundusz Zdrowia'!F44","v":0},{"$f":"'63-Narodowy Fundusz Zdrowia'!G44","v":0},{"$f":"'63-Narodowy Fundusz Zdrowia'!D45","v":0},{"$f":"'63-Narodowy Fundusz Zdrowia'!E45","v":0},{"$f":"'63-Narodowy Fundusz Zdrowia'!F45","v":0},{"$f":"'63-Narodowy Fundusz Zdrowia'!G45","v":0}]
[{"$f":"'71-ZUS'!A8","v":0},null,null,null,null,{"$f":"'71-ZUS'!L11","v":71},{"$f":"'71-ZUS'!K8","v":0},{"$f":"'71-ZUS'!H8","v":4},{"$f":"'71-ZUS'!M11","v":0},null,null,{"$f":"'71-ZUS'!D33","v":0},{"$f":"'71-ZUS'!E33","v":0},{"$f":"'71-ZUS'!F33","v":0},{"$f":"'71-ZUS'!G33","v":0},{"$f":"'71-ZUS'!D34","v":0},{"$f":"'71-ZUS'!E34","v":0},{"$f":"'71-ZUS'!F34","v":0},{"$f":"'71-ZUS'!G34","v":0},{"$f":"'71-ZUS'!D35","v":0},{"$f":"'71-ZUS'!E35","v":0},{"$f":"'71-ZUS'!F35","v":0},{"$f":"'71-ZUS'!G35","v":0},{"$f":"'71-ZUS'!D36","v":0},{"$f":"'71-ZUS'!E36","v":0},{"$f":"'71-ZUS'!F36","v":0},{"$f":"'71-ZUS'!G36","v":0},{"$f":"'71-ZUS'!D37","v":0},{"$f":"'71-ZUS'!E37","v":0},{"$f":"'71-ZUS'!F37","v":0},{"$f":"'71-ZUS'!G37","v":0},{"$f":"'71-ZUS'!D38","v":0},{"$f":"'71-ZUS'!E38","v":0},{"$f":"'71-ZUS'!F38","v":0},{"$f":"'71-ZUS'!G38","v":0},{"$f":"'71-ZUS'!D39","v":0},{"$f":"'71-ZUS'!E39","v":0},{"$f":"'71-ZUS'!F39","v":0},{"$f":"'71-ZUS'!G39","v":0},{"$f":"'71-ZUS'!D40","v":0},{"$f":"'71-ZUS'!E40","v":0},{"$f":"'71-ZUS'!F40","v":0},{"$f":"'71-ZUS'!G40","v":0},{"$f":"'71-ZUS'!D41","v":0},{"$f":"'71-ZUS'!E41","v":0},{"$f":"'71-ZUS'!F41","v":0},{"$f":"'71-ZUS'!G41","v":0},{"$f":"'71-ZUS'!D42","v":0},{"$f":"'71-ZUS'!E42","v":0},{"$f":"'71-ZUS'!F42","v":0},{"$f":"'71-ZUS'!G42","v":0},{"$f":"'71-ZUS'!D43","v":0},{"$f":"'71-ZUS'!E43","v":0},{"$f":"'71-ZUS'!F43","v":0},{"$f":"'71-ZUS'!G43","v":0},{"$f":"'71-ZUS'!D44","v":0},{"$f":"'71-ZUS'!E44","v":0},{"$f":"'71-ZUS'!F44","v":0},{"$f":"'71-ZUS'!G44","v":0},{"$f":"'71-ZUS'!D45","v":0},{"$f":"'71-ZUS'!E45","v":0},{"$f":"'71-ZUS'!F45","v":0},{"$f":"'71-ZUS'!G45","v":0}]
[{"$f":"'72-fund.zarz.przez ZUS'!A8:B8","v":0},null,null,null,null,{"$f":"'72-fund.zarz.przez ZUS'!L11","v":72},{"$f":"'72-fund.zarz.przez ZUS'!K8","v":0},{"$f":"'72-fund.zarz.przez ZUS'!H8","v":4},{"$f":"'72-fund.zarz.przez ZUS'!M11","v":0},null,null,{"$f":"'72-fund.zarz.przez ZUS'!D33","v":0},{"$f":"'72-fund.zarz.przez ZUS'!E33","v":0},{"$f":"'72-fund.zarz.przez ZUS'!F33","v":0},{"$f":"'72-fund.zarz.przez ZUS'!G33","v":0},{"$f":"'72-fund.zarz.przez ZUS'!D34","v":0},{"$f":"'72-fund.zarz.przez ZUS'!E34","v":0},{"$f":"'72-fund.zarz.przez ZUS'!F34","v":0},{"$f":"'72-fund.zarz.przez ZUS'!G34","v":0},{"$f":"'72-fund.zarz.przez ZUS'!D35","v":0},{"$f":"'72-fund.zarz.przez ZUS'!E35","v":0},{"$f":"'72-fund.zarz.przez ZUS'!F35","v":0},{"$f":"'72-fund.zarz.przez ZUS'!G35","v":0},{"$f":"'72-fund.zarz.przez ZUS'!D36","v":0},{"$f":"'72-fund.zarz.przez ZUS'!E36","v":0},{"$f":"'72-fund.zarz.przez ZUS'!F36","v":0},{"$f":"'72-fund.zarz.przez ZUS'!G36","v":0},{"$f":"'72-fund.zarz.przez ZUS'!D37","v":0},{"$f":"'72-fund.zarz.przez ZUS'!E37","v":0},{"$f":"'72-fund.zarz.przez ZUS'!F37","v":0},{"$f":"'72-fund.zarz.przez ZUS'!G37","v":0},{"$f":"'72-fund.zarz.przez ZUS'!D38","v":0},{"$f":"'72-fund.zarz.przez ZUS'!E38","v":0},{"$f":"'72-fund.zarz.przez ZUS'!F38","v":0},{"$f":"'72-fund.zarz.przez ZUS'!G38","v":0},{"$f":"'72-fund.zarz.przez ZUS'!D39","v":0},{"$f":"'72-fund.zarz.przez ZUS'!E39","v":0},{"$f":"'72-fund.zarz.przez ZUS'!F39","v":0},{"$f":"'72-fund.zarz.przez ZUS'!G39","v":0},{"$f":"'72-fund.zarz.przez ZUS'!D40","v":0},{"$f":"'72-fund.zarz.przez ZUS'!E40","v":0},{"$f":"'72-fund.zarz.przez ZUS'!F40","v":0},{"$f":"'72-fund.zarz.przez ZUS'!G40","v":0},{"$f":"'72-fund.zarz.przez ZUS'!D41","v":0},{"$f":"'72-fund.zarz.przez ZUS'!E41","v":0},{"$f":"'72-fund.zarz.przez ZUS'!F41","v":0},{"$f":"'72-fund.zarz.przez ZUS'!G41","v":0},{"$f":"'72-fund.zarz.przez ZUS'!D42","v":0},{"$f":"'72-fund.zarz.przez ZUS'!E42","v":0},{"$f":"'72-fund.zarz.przez ZUS'!F42","v":0},{"$f":"'72-fund.zarz.przez ZUS'!G42","v":0},{"$f":"'72-fund.zarz.przez ZUS'!D43","v":0},{"$f":"'72-fund.zarz.przez ZUS'!E43","v":0},{"$f":"'72-fund.zarz.przez ZUS'!F43","v":0},{"$f":"'72-fund.zarz.przez ZUS'!G43","v":0},{"$f":"'72-fund.zarz.przez ZUS'!D44","v":0},{"$f":"'72-fund.zarz.przez ZUS'!E44","v":0},{"$f":"'72-fund.zarz.przez ZUS'!F44","v":0},{"$f":"'72-fund.zarz.przez ZUS'!G44","v":0},{"$f":"'72-fund.zarz.przez ZUS'!D45","v":0},{"$f":"'72-fund.zarz.przez ZUS'!E45","v":0},{"$f":"'72-fund.zarz.przez ZUS'!F45","v":0},{"$f":"'72-fund.zarz.przez ZUS'!G45","v":0}]
[{"$f":"'73-KRUS'!A8:B8","v":0},null,null,null,null,{"$f":"'73-KRUS'!L11","v":73},{"$f":"'73-KRUS'!K8","v":0},{"$f":"'73-KRUS'!H8","v":4},{"$f":"'73-KRUS'!M11","v":0},null,null,{"$f":"'73-KRUS'!D33","v":0},{"$f":"'73-KRUS'!E33","v":0},{"$f":"'73-KRUS'!F33","v":0},{"$f":"'73-KRUS'!G33","v":0},{"$f":"'73-KRUS'!D34","v":0},{"$f":"'73-KRUS'!E34","v":0},{"$f":"'73-KRUS'!F34","v":0},{"$f":"'73-KRUS'!G34","v":0},{"$f":"'73-KRUS'!D35","v":0},{"$f":"'73-KRUS'!E35","v":0},{"$f":"'73-KRUS'!F35","v":0},{"$f":"'73-KRUS'!G35","v":0},{"$f":"'73-KRUS'!D36","v":0},{"$f":"'73-KRUS'!E36","v":0},{"$f":"'73-KRUS'!F36","v":0},{"$f":"'73-KRUS'!G36","v":0},{"$f":"'73-KRUS'!D37","v":0},{"$f":"'73-KRUS'!E37","v":0},{"$f":"'73-KRUS'!F37","v":0},{"$f":"'73-KRUS'!G37","v":0},{"$f":"'73-KRUS'!D38","v":0},{"$f":"'73-KRUS'!E38","v":0},{"$f":"'73-KRUS'!F38","v":0},{"$f":"'73-KRUS'!G38","v":0},{"$f":"'73-KRUS'!D39","v":0},{"$f":"'73-KRUS'!E39","v":0},{"$f":"'73-KRUS'!F39","v":0},{"$f":"'73-KRUS'!G39","v":0},{"$f":"'73-KRUS'!D40","v":0},{"$f":"'73-KRUS'!E40","v":0},{"$f":"'73-KRUS'!F40","v":0},{"$f":"'73-KRUS'!G40","v":0},{"$f":"'73-KRUS'!D41","v":0},{"$f":"'73-KRUS'!E41","v":0},{"$f":"'73-KRUS'!F41","v":0},{"$f":"'73-KRUS'!G41","v":0},{"$f":"'73-KRUS'!D42","v":0},{"$f":"'73-KRUS'!E42","v":0},{"$f":"'73-KRUS'!F42","v":0},{"$f":"'73-KRUS'!G42","v":0},{"$f":"'73-KRUS'!D43","v":0},{"$f":"'73-KRUS'!E43","v":0},{"$f":"'73-KRUS'!F43","v":0},{"$f":"'73-KRUS'!G43","v":0},{"$f":"'73-KRUS'!D44","v":0},{"$f":"'73-KRUS'!E44","v":0},{"$f":"'73-KRUS'!F44","v":0},{"$f":"'73-KRUS'!G44","v":0},{"$f":"'73-KRUS'!D45","v":0},{"$f":"'73-KRUS'!E45","v":0},{"$f":"'73-KRUS'!F45","v":0},{"$f":"'73-KRUS'!G45","v":0}]
[{"$f":"'81-państw.osoba prawna'!A8","v":0},null,null,null,null,{"$f":"'81-państw.osoba prawna'!L11","v":81},{"$f":"'81-państw.osoba prawna'!K8","v":0},{"$f":"'81-państw.osoba prawna'!H8","v":4},{"$f":"'81-państw.osoba prawna'!M11","v":0},null,null,{"$f":"'81-państw.osoba prawna'!D33","v":0},{"$f":"'81-państw.osoba prawna'!E33","v":0},{"$f":"'81-państw.osoba prawna'!F33","v":0},{"$f":"'81-państw.osoba prawna'!G33","v":0},{"$f":"'81-państw.osoba prawna'!D34","v":0},{"$f":"'81-państw.osoba prawna'!E34","v":0},{"$f":"'81-państw.osoba prawna'!F34","v":0},{"$f":"'81-państw.osoba prawna'!G34","v":0},{"$f":"'81-państw.osoba prawna'!D35","v":0},{"$f":"'81-państw.osoba prawna'!E35","v":0},{"$f":"'81-państw.osoba prawna'!F35","v":0},{"$f":"'81-państw.osoba prawna'!G35","v":0},{"$f":"'81-państw.osoba prawna'!D36","v":0},{"$f":"'81-państw.osoba prawna'!E36","v":0},{"$f":"'81-państw.osoba prawna'!F36","v":0},{"$f":"'81-państw.osoba prawna'!G36","v":0},{"$f":"'81-państw.osoba prawna'!D37","v":0},{"$f":"'81-państw.osoba prawna'!E37","v":0},{"$f":"'81-państw.osoba prawna'!F37","v":0},{"$f":"'81-państw.osoba prawna'!G37","v":0},{"$f":"'81-państw.osoba prawna'!D38","v":0},{"$f":"'81-państw.osoba prawna'!E38","v":0},{"$f":"'81-państw.osoba prawna'!F38","v":0},{"$f":"'81-państw.osoba prawna'!G38","v":0},{"$f":"'81-państw.osoba prawna'!D39","v":0},{"$f":"'81-państw.osoba prawna'!E39","v":0},{"$f":"'81-państw.osoba prawna'!F39","v":0},{"$f":"'81-państw.osoba prawna'!G39","v":0},{"$f":"'81-państw.osoba prawna'!D40","v":0},{"$f":"'81-państw.osoba prawna'!E40","v":0},{"$f":"'81-państw.osoba prawna'!F40","v":0},{"$f":"'81-państw.osoba prawna'!G40","v":0},{"$f":"'81-państw.osoba prawna'!D41","v":0},{"$f":"'81-państw.osoba prawna'!E41","v":0},{"$f":"'81-państw.osoba prawna'!F41","v":0},{"$f":"'81-państw.osoba prawna'!G41","v":0},{"$f":"'81-państw.osoba prawna'!D42","v":0},{"$f":"'81-państw.osoba prawna'!E42","v":0},{"$f":"'81-państw.osoba prawna'!F42","v":0},{"$f":"'81-państw.osoba prawna'!G42","v":0},{"$f":"'81-państw.osoba prawna'!D43","v":0},{"$f":"'81-państw.osoba prawna'!E43","v":0},{"$f":"'81-państw.osoba prawna'!F43","v":0},{"$f":"'81-państw.osoba prawna'!G43","v":0},{"$f":"'81-państw.osoba prawna'!D44","v":0},{"$f":"'81-państw.osoba prawna'!E44","v":0},{"$f":"'81-państw.osoba prawna'!F44","v":0},{"$f":"'81-państw.osoba prawna'!G44","v":0},{"$f":"'81-państw.osoba prawna'!D45","v":0},{"$f":"'81-państw.osoba prawna'!E45","v":0},{"$f":"'81-państw.osoba prawna'!F45","v":0},{"$f":"'81-państw.osoba prawna'!G45","v":0}]
[{"$f":"'82-samorz.osoba prawna'!A8","v":0},null,null,null,null,{"$f":"'82-samorz.osoba prawna'!L11","v":82},{"$f":"'82-samorz.osoba prawna'!K8","v":0},{"$f":"'82-samorz.osoba prawna'!H8","v":4},{"$f":"'82-samorz.osoba prawna'!M11","v":0},null,null,{"$f":"'82-samorz.osoba prawna'!D33","v":0},{"$f":"'82-samorz.osoba prawna'!E33","v":0},{"$f":"'82-samorz.osoba prawna'!F33","v":0},{"$f":"'82-samorz.osoba prawna'!G33","v":0},{"$f":"'82-samorz.osoba prawna'!D34","v":0},{"$f":"'82-samorz.osoba prawna'!E34","v":0},{"$f":"'82-samorz.osoba prawna'!F34","v":0},{"$f":"'82-samorz.osoba prawna'!G34","v":0},{"$f":"'82-samorz.osoba prawna'!D35","v":0},{"$f":"'82-samorz.osoba prawna'!E35","v":0},{"$f":"'82-samorz.osoba prawna'!F35","v":0},{"$f":"'82-samorz.osoba prawna'!G35","v":0},{"$f":"'82-samorz.osoba prawna'!D36","v":0},{"$f":"'82-samorz.osoba prawna'!E36","v":0},{"$f":"'82-samorz.osoba prawna'!F36","v":0},{"$f":"'82-samorz.osoba prawna'!G36","v":0},{"$f":"'82-samorz.osoba prawna'!D37","v":0},{"$f":"'82-samorz.osoba prawna'!E37","v":0},{"$f":"'82-samorz.osoba prawna'!F37","v":0},{"$f":"'82-samorz.osoba prawna'!G37","v":0},{"$f":"'82-samorz.osoba prawna'!D38","v":0},{"$f":"'82-samorz.osoba prawna'!E38","v":0},{"$f":"'82-samorz.osoba prawna'!F38","v":0},{"$f":"'82-samorz.osoba prawna'!G38","v":0},{"$f":"'82-samorz.osoba prawna'!D39","v":0},{"$f":"'82-samorz.osoba prawna'!E39","v":0},{"$f":"'82-samorz.osoba prawna'!F39","v":0},{"$f":"'82-samorz.osoba prawna'!G39","v":0},{"$f":"'82-samorz.osoba prawna'!D40","v":0},{"$f":"'82-samorz.osoba prawna'!E40","v":0},{"$f":"'82-samorz.osoba prawna'!F40","v":0},{"$f":"'82-samorz.osoba prawna'!G40","v":0},{"$f":"'82-samorz.osoba prawna'!D41","v":0},{"$f":"'82-samorz.osoba prawna'!E41","v":0},{"$f":"'82-samorz.osoba prawna'!F41","v":0},{"$f":"'82-samorz.osoba prawna'!G41","v":0},{"$f":"'82-samorz.osoba prawna'!D42","v":0},{"$f":"'82-samorz.osoba prawna'!E42","v":0},{"$f":"'82-samorz.osoba prawna'!F42","v":0},{"$f":"'82-samorz.osoba prawna'!G42","v":0},{"$f":"'82-samorz.osoba prawna'!D43","v":0},{"$f":"'82-samorz.osoba prawna'!E43","v":0},{"$f":"'82-samorz.osoba prawna'!F43","v":0},{"$f":"'82-samorz.osoba prawna'!G43","v":0},{"$f":"'82-samorz.osoba prawna'!D44","v":0},{"$f":"'82-samorz.osoba prawna'!E44","v":0},{"$f":"'82-samorz.osoba prawna'!F44","v":0},{"$f":"'82-samorz.osoba prawna'!G44","v":0},{"$f":"'82-samorz.osoba prawna'!D45","v":0},{"$f":"'82-samorz.osoba prawna'!E45","v":0},{"$f":"'82-samorz.osoba prawna'!F45","v":0},{"$f":"'82-samorz.osoba prawna'!G45","v":0}]
[{"$f":"'90-agencja wykonawcza'!A8","v":0},null,null,null,null,{"$f":"'90-agencja wykonawcza'!L11","v":90},{"$f":"'90-agencja wykonawcza'!K8","v":0},{"$f":"'90-agencja wykonawcza'!H8","v":4},{"$f":"'90-agencja wykonawcza'!M11","v":0},null,null,{"$f":"'90-agencja wykonawcza'!D33","v":0},{"$f":"'90-agencja wykonawcza'!E33","v":0},{"$f":"'90-agencja wykonawcza'!F33","v":0},{"$f":"'90-agencja wykonawcza'!G33","v":0},{"$f":"'90-agencja wykonawcza'!D34","v":0},{"$f":"'90-agencja wykonawcza'!E34","v":0},{"$f":"'90-agencja wykonawcza'!F34","v":0},{"$f":"'90-agencja wykonawcza'!G34","v":0},{"$f":"'90-agencja wykonawcza'!D35","v":0},{"$f":"'90-agencja wykonawcza'!E35","v":0},{"$f":"'90-agencja wykonawcza'!F35","v":0},{"$f":"'90-agencja wykonawcza'!G35","v":0},{"$f":"'90-agencja wykonawcza'!D36","v":0},{"$f":"'90-agencja wykonawcza'!E36","v":0},{"$f":"'90-agencja wykonawcza'!F36","v":0},{"$f":"'90-agencja wykonawcza'!G36","v":0},{"$f":"'90-agencja wykonawcza'!D37","v":0},{"$f":"'90-agencja wykonawcza'!E37","v":0},{"$f":"'90-agencja wykonawcza'!F37","v":0},{"$f":"'90-agencja wykonawcza'!G37","v":0},{"$f":"'90-agencja wykonawcza'!D38","v":0},{"$f":"'90-agencja wykonawcza'!E38","v":0},{"$f":"'90-agencja wykonawcza'!F38","v":0},{"$f":"'90-agencja wykonawcza'!G38","v":0},{"$f":"'90-agencja wykonawcza'!D39","v":0},{"$f":"'90-agencja wykonawcza'!E39","v":0},{"$f":"'90-agencja wykonawcza'!F39","v":0},{"$f":"'90-agencja wykonawcza'!G39","v":0},{"$f":"'90-agencja wykonawcza'!D40","v":0},{"$f":"'90-agencja wykonawcza'!E40","v":0},{"$f":"'90-agencja wykonawcza'!F40","v":0},{"$f":"'90-agencja wykonawcza'!G40","v":0},{"$f":"'90-agencja wykonawcza'!D41","v":0},{"$f":"'90-agencja wykonawcza'!E41","v":0},{"$f":"'90-agencja wykonawcza'!F41","v":0},{"$f":"'90-agencja wykonawcza'!G41","v":0},{"$f":"'90-agencja wykonawcza'!D42","v":0},{"$f":"'90-agencja wykonawcza'!E42","v":0},{"$f":"'90-agencja wykonawcza'!F42","v":0},{"$f":"'90-agencja wykonawcza'!G42","v":0},{"$f":"'90-agencja wykonawcza'!D43","v":0},{"$f":"'90-agencja wykonawcza'!E43","v":0},{"$f":"'90-agencja wykonawcza'!F43","v":0},{"$f":"'90-agencja wykonawcza'!G43","v":0},{"$f":"'90-agencja wykonawcza'!D44","v":0},{"$f":"'90-agencja wykonawcza'!E44","v":0},{"$f":"'90-agencja wykonawcza'!F44","v":0},{"$f":"'90-agencja wykonawcza'!G44","v":0},{"$f":"'90-agencja wykonawcza'!D45","v":0},{"$f":"'90-agencja wykonawcza'!E45","v":0},{"$f":"'90-agencja wykonawcza'!F45","v":0},{"$f":"'90-agencja wykonawcza'!G45","v":0}]
[{"$f":"'99-zbiorczo'!A8","v":"Brak nr REGON"},null,null,null,null,{"$f":"'99-zbiorczo'!L11","v":99},{"$f":"'99-zbiorczo'!K8","v":"Brak roku"},{"$f":"'99-zbiorczo'!H8","v":4},{"$f":"'99-zbiorczo'!M11","v":0},null,null,{"$f":"'99-zbiorczo'!D33","v":0},{"$f":"'99-zbiorczo'!E33","v":0},{"$f":"'99-zbiorczo'!F33","v":0},{"$f":"'99-zbiorczo'!G33","v":0},{"$f":"'99-zbiorczo'!D34","v":0},{"$f":"'99-zbiorczo'!E34","v":0},{"$f":"'99-zbiorczo'!F34","v":0},{"$f":"'99-zbiorczo'!G34","v":0},{"$f":"'99-zbiorczo'!D35","v":0},{"$f":"'99-zbiorczo'!E35","v":0},{"$f":"'99-zbiorczo'!F35","v":0},{"$f":"'99-zbiorczo'!G35","v":0},{"$f":"'99-zbiorczo'!D36","v":0},{"$f":"'99-zbiorczo'!E36","v":0},{"$f":"'99-zbiorczo'!F36","v":0},{"$f":"'99-zbiorczo'!G36","v":0},{"$f":"'99-zbiorczo'!D37","v":0},{"$f":"'99-zbiorczo'!E37","v":0},{"$f":"'99-zbiorczo'!F37","v":0},{"$f":"'99-zbiorczo'!G37","v":0},{"$f":"'99-zbiorczo'!D38","v":0},{"$f":"'99-zbiorczo'!E38","v":0},{"$f":"'99-zbiorczo'!F38","v":0},{"$f":"'99-zbiorczo'!G38","v":0},{"$f":"'99-zbiorczo'!D39","v":0},{"$f":"'99-zbiorczo'!E39","v":0},{"$f":"'99-zbiorczo'!F39","v":0},{"$f":"'99-zbiorczo'!G39","v":0},{"$f":"'99-zbiorczo'!D40","v":0},{"$f":"'99-zbiorczo'!E40","v":0},{"$f":"'99-zbiorczo'!F40","v":0},{"$f":"'99-zbiorczo'!G40","v":0},{"$f":"'99-zbiorczo'!D41","v":0},{"$f":"'99-zbiorczo'!E41","v":0},{"$f":"'99-zbiorczo'!F41","v":0},{"$f":"'99-zbiorczo'!G41","v":0},{"$f":"'99-zbiorczo'!D42","v":0},{"$f":"'99-zbiorczo'!E42","v":0},{"$f":"'99-zbiorczo'!F42","v":0},{"$f":"'99-zbiorczo'!G42","v":0},{"$f":"'99-zbiorczo'!D43","v":0},{"$f":"'99-zbiorczo'!E43","v":0},{"$f":"'99-zbiorczo'!F43","v":0},{"$f":"'99-zbiorczo'!G43","v":0},{"$f":"'99-zbiorczo'!D44","v":0},{"$f":"'99-zbiorczo'!E44","v":0},{"$f":"'99-zbiorczo'!F44","v":0},{"$f":"'99-zbiorczo'!G44","v":0},{"$f":"'99-zbiorczo'!D45","v":0},{"$f":"'99-zbiorczo'!E45","v":0},{"$f":"'99-zbiorczo'!F45","v":0},{"$f":"'99-zbiorczo'!G45","v":0}]

{"sheet":"RBUZB2","index":18,"n_rows":17,"n_cols":63,"rows_kept":17,"cut":false,"hidden":true,"merged":[]}
["REGON","WK","PK","GK","GT","PT","ROK","KWARTAL","CZ_BU","DAT_SKW","UWAGI","B20102","B20103","B20104","B20105","B20202","B20203","B20204","B20205","B20302","B20303","B20304","B20305","B20402","B20403","B20404","B20405","B20502","B20503","B20504","B20505","B20602","B20603","B20604","B20605","B20702","B20703","B20704","B20705","B20802","B20803","B20804","B20805","B20902","B20903","B20904","B20905","B21002","B21003","B21004","B21005","B21102","B21103","B21104","B21105","B21202","B21203","B21204","B21205","B21302","B21303","B21304","B21305"]
[{"$f":"'11-państw.fund.cel.'!A8","v":0},null,null,null,null,{"$f":"'11-państw.fund.cel.'!L11","v":11},{"$f":"'11-państw.fund.cel.'!K8","v":0},{"$f":"'11-państw.fund.cel.'!H8","v":4},{"$f":"'11-państw.fund.cel.'!M11","v":0},null,null,{"$f":"'11-państw.fund.cel.'!M33","v":0},{"$f":"'11-państw.fund.cel.'!N33","v":0},{"$f":"'11-państw.fund.cel.'!O33","v":0},{"$f":"'11-państw.fund.cel.'!P33","v":0},{"$f":"'11-państw.fund.cel.'!M34","v":0},{"$f":"'11-państw.fund.cel.'!N34","v":0},{"$f":"'11-państw.fund.cel.'!O34","v":0},{"$f":"'11-państw.fund.cel.'!P34","v":0},{"$f":"'11-państw.fund.cel.'!M35","v":0},{"$f":"'11-państw.fund.cel.'!N35","v":0},{"$f":"'11-państw.fund.cel.'!O35","v":0},{"$f":"'11-państw.fund.cel.'!P35","v":0},{"$f":"'11-państw.fund.cel.'!M36","v":0},{"$f":"'11-państw.fund.cel.'!N36","v":0},{"$f":"'11-państw.fund.cel.'!O36","v":0},{"$f":"'11-państw.fund.cel.'!P36","v":0},{"$f":"'11-państw.fund.cel.'!M37","v":0},{"$f":"'11-państw.fund.cel.'!N37","v":0},{"$f":"'11-państw.fund.cel.'!O37","v":0},{"$f":"'11-państw.fund.cel.'!P37","v":0},{"$f":"'11-państw.fund.cel.'!M38","v":0},{"$f":"'11-państw.fund.cel.'!N38","v":0},{"$f":"'11-państw.fund.cel.'!O38","v":0},{"$f":"'11-państw.fund.cel.'!P38","v":0},{"$f":"'11-państw.fund.cel.'!M39","v":0},{"$f":"'11-państw.fund.cel.'!N39","v":0},{"$f":"'11-państw.fund.cel.'!O39","v":0},{"$f":"'11-państw.fund.cel.'!P39","v":0},{"$f":"'11-państw.fund.cel.'!M40","v":0},{"$f":"'11-państw.fund.cel.'!N40","v":0},{"$f":"'11-państw.fund.cel.'!O40","v":0},{"$f":"'11-państw.fund.cel.'!P40","v":0},{"$f":"'11-państw.fund.cel.'!M41","v":0},{"$f":"'11-państw.fund.cel.'!N41","v":0},{"$f":"'11-państw.fund.cel.'!O41","v":0},{"$f":"'11-państw.fund.cel.'!P41","v":0},{"$f":"'11-państw.fund.cel.'!M42","v":0},{"$f":"'11-państw.fund.cel.'!N42","v":0},{"$f":"'11-państw.fund.cel.'!O42","v":0},{"$f":"'11-państw.fund.cel.'!P42","v":0},{"$f":"'11-państw.fund.cel.'!M43","v":0},{"$f":"'11-państw.fund.cel.'!N43","v":0},{"$f":"'11-państw.fund.cel.'!O43","v":0},{"$f":"'11-państw.fund.cel.'!P43","v":0},{"$f":"'11-państw.fund.cel.'!M44","v":0},{"$f":"'11-państw.fund.cel.'!N44","v":0},{"$f":"'11-państw.fund.cel.'!O44","v":0},{"$f":"'11-państw.fund.cel.'!P44","v":0},{"$f":"'11-państw.fund.cel.'!M45","v":0},{"$f":"'11-państw.fund.cel.'!N45","v":0},{"$f":"'11-państw.fund.cel.'!O45","v":0},{"$f":"'11-państw.fund.cel.'!P45","v":0}]
[{"$f":"'20-państw.szk.wyż.'!A8","v":0},null,null,null,null,{"$f":"'20-państw.szk.wyż.'!L11","v":20},{"$f":"'20-państw.szk.wyż.'!K8","v":0},{"$f":"'20-państw.szk.wyż.'!H8","v":4},{"$f":"'20-państw.szk.wyż.'!M11","v":0},null,null,{"$f":"'20-państw.szk.wyż.'!M33","v":0},{"$f":"'20-państw.szk.wyż.'!N33","v":0},{"$f":"'20-państw.szk.wyż.'!O33","v":0},{"$f":"'20-państw.szk.wyż.'!P33","v":0},{"$f":"'20-państw.szk.wyż.'!M34","v":0},{"$f":"'20-państw.szk.wyż.'!N34","v":0},{"$f":"'20-państw.szk.wyż.'!O34","v":0},{"$f":"'20-państw.szk.wyż.'!P34","v":0},{"$f":"'20-państw.szk.wyż.'!M35","v":0},{"$f":"'20-państw.szk.wyż.'!N35","v":0},{"$f":"'20-państw.szk.wyż.'!O35","v":0},{"$f":"'20-państw.szk.wyż.'!P35","v":0},{"$f":"'20-państw.szk.wyż.'!M36","v":0},{"$f":"'20-państw.szk.wyż.'!N36","v":0},{"$f":"'20-państw.szk.wyż.'!O36","v":0},{"$f":"'20-państw.szk.wyż.'!P36","v":0},{"$f":"'20-państw.szk.wyż.'!M37","v":0},{"$f":"'20-państw.szk.wyż.'!N37","v":0},{"$f":"'20-państw.szk.wyż.'!O37","v":0},{"$f":"'20-państw.szk.wyż.'!P37","v":0},{"$f":"'20-państw.szk.wyż.'!M38","v":0},{"$f":"'20-państw.szk.wyż.'!N38","v":0},{"$f":"'20-państw.szk.wyż.'!O38","v":0},{"$f":"'20-państw.szk.wyż.'!P38","v":0},{"$f":"'20-państw.szk.wyż.'!M39","v":0},{"$f":"'20-państw.szk.wyż.'!N39","v":0},{"$f":"'20-państw.szk.wyż.'!O39","v":0},{"$f":"'20-państw.szk.wyż.'!P39","v":0},{"$f":"'20-państw.szk.wyż.'!M40","v":0},{"$f":"'20-państw.szk.wyż.'!N40","v":0},{"$f":"'20-państw.szk.wyż.'!O40","v":0},{"$f":"'20-państw.szk.wyż.'!P40","v":0},{"$f":"'20-państw.szk.wyż.'!M41","v":0},{"$f":"'20-państw.szk.wyż.'!N41","v":0},{"$f":"'20-państw.szk.wyż.'!O41","v":0},{"$f":"'20-państw.szk.wyż.'!P41","v":0},{"$f":"'20-państw.szk.wyż.'!M42","v":0},{"$f":"'20-państw.szk.wyż.'!N42","v":0},{"$f":"'20-państw.szk.wyż.'!O42","v":0},{"$f":"'20-państw.szk.wyż.'!P42","v":0},{"$f":"'20-państw.szk.wyż.'!M43","v":0},{"$f":"'20-państw.szk.wyż.'!N43","v":0},{"$f":"'20-państw.szk.wyż.'!O43","v":0},{"$f":"'20-państw.szk.wyż.'!P43","v":0},{"$f":"'20-państw.szk.wyż.'!M44","v":0},{"$f":"'20-państw.szk.wyż.'!N44","v":0},{"$f":"'20-państw.szk.wyż.'!O44","v":0},{"$f":"'20-państw.szk.wyż.'!P44","v":0},{"$f":"'20-państw.szk.wyż.'!M45","v":0},{"$f":"'20-państw.szk.wyż.'!N45","v":0},{"$f":"'20-państw.szk.wyż.'!O45","v":0},{"$f":"'20-państw.szk.wyż.'!P45","v":0}]
[{"$f":"'31-instytucje gosp budż'!A8","v":0},null,null,null,null,{"$f":"'31-instytucje gosp budż'!L11","v":31},{"$f":"'31-instytucje gosp budż'!K8","v":0},{"$f":"'31-instytucje gosp budż'!H8","v":4},{"$f":"'31-instytucje gosp budż'!M11","v":0},null,null,{"$f":"'31-instytucje gosp budż'!M33","v":0},{"$f":"'31-instytucje gosp budż'!N33","v":0},{"$f":"'31-instytucje gosp budż'!O33","v":0},{"$f":"'31-instytucje gosp budż'!P33","v":0},{"$f":"'31-instytucje gosp budż'!M34","v":0},{"$f":"'31-instytucje gosp budż'!N34","v":0},{"$f":"'31-instytucje gosp budż'!O34","v":0},{"$f":"'31-instytucje gosp budż'!P34","v":0},{"$f":"'31-instytucje gosp budż'!M35","v":0},{"$f":"'31-instytucje gosp budż'!N35","v":0},{"$f":"'31-instytucje gosp budż'!O35","v":0},{"$f":"'31-instytucje gosp budż'!P35","v":0},{"$f":"'31-instytucje gosp budż'!M36","v":0},{"$f":"'31-instytucje gosp budż'!N36","v":0},{"$f":"'31-instytucje gosp budż'!O36","v":0},{"$f":"'31-instytucje gosp budż'!P36","v":0},{"$f":"'31-instytucje gosp budż'!M37","v":0},{"$f":"'31-instytucje gosp budż'!N37","v":0},{"$f":"'31-instytucje gosp budż'!O37","v":0},{"$f":"'31-instytucje gosp budż'!P37","v":0},{"$f":"'31-instytucje gosp budż'!M38","v":0},{"$f":"'31-instytucje gosp budż'!N38","v":0},{"$f":"'31-instytucje gosp budż'!O38","v":0},{"$f":"'31-instytucje gosp budż'!P38","v":0},{"$f":"'31-instytucje gosp budż'!M39","v":0},{"$f":"'31-instytucje gosp budż'!N39","v":0},{"$f":"'31-instytucje gosp budż'!O39","v":0},{"$f":"'31-instytucje gosp budż'!P39","v":0},{"$f":"'31-instytucje gosp budż'!M40","v":0},{"$f":"'31-instytucje gosp budż'!N40","v":0},{"$f":"'31-instytucje gosp budż'!O40","v":0},{"$f":"'31-instytucje gosp budż'!P40","v":0},{"$f":"'31-instytucje gosp budż'!M41","v":0},{"$f":"'31-instytucje gosp budż'!N41","v":0},{"$f":"'31-instytucje gosp budż'!O41","v":0},{"$f":"'31-instytucje gosp budż'!P41","v":0},{"$f":"'31-instytucje gosp budż'!M42","v":0},{"$f":"'31-instytucje gosp budż'!N42","v":0},{"$f":"'31-instytucje gosp budż'!O42","v":0},{"$f":"'31-instytucje gosp budż'!P42","v":0},{"$f":"'31-instytucje gosp budż'!M43","v":0},{"$f":"'31-instytucje gosp budż'!N43","v":0},{"$f":"'31-instytucje gosp budż'!O43","v":0},{"$f":"'31-instytucje gosp budż'!P43","v":0},{"$f":"'31-instytucje gosp budż'!M44","v":0},{"$f":"'31-instytucje gosp budż'!N44","v":0},{"$f":"'31-instytucje gosp budż'!O44","v":0},{"$f":"'31-instytucje gosp budż'!P44","v":0},{"$f":"'31-instytucje gosp budż'!M45","v":0},{"$f":"'31-instytucje gosp budż'!N45","v":0},{"$f":"'31-instytucje gosp budż'!O45","v":0},{"$f":"'31-instytucje gosp budż'!P45","v":0}]
[{"$f":"'41-państw.inst.kult.'!A8","v":0},null,null,null,null,{"$f":"'41-państw.inst.kult.'!L11","v":41},{"$f":"'41-państw.inst.kult.'!K8","v":0},{"$f":"'41-państw.inst.kult.'!H8","v":4},{"$f":"'41-państw.inst.kult.'!M11","v":0},null,null,{"$f":"'41-państw.inst.kult.'!M33","v":0},{"$f":"'41-państw.inst.kult.'!N33","v":0},{"$f":"'41-państw.inst.kult.'!O33","v":0},{"$f":"'41-państw.inst.kult.'!P33","v":0},{"$f":"'41-państw.inst.kult.'!M34","v":0},{"$f":"'41-państw.inst.kult.'!N34","v":0},{"$f":"'41-państw.inst.kult.'!O34","v":0},{"$f":"'41-państw.inst.kult.'!P34","v":0},{"$f":"'41-państw.inst.kult.'!M35","v":0},{"$f":"'41-państw.inst.kult.'!N35","v":0},{"$f":"'41-państw.inst.kult.'!O35","v":0},{"$f":"'41-państw.inst.kult.'!P35","v":0},{"$f":"'41-państw.inst.kult.'!M36","v":0},{"$f":"'41-państw.inst.kult.'!N36","v":0},{"$f":"'41-państw.inst.kult.'!O36","v":0},{"$f":"'41-państw.inst.kult.'!P36","v":0},{"$f":"'41-państw.inst.kult.'!M37","v":0},{"$f":"'41-państw.inst.kult.'!N37","v":0},{"$f":"'41-państw.inst.kult.'!O37","v":0},{"$f":"'41-państw.inst.kult.'!P37","v":0},{"$f":"'41-państw.inst.kult.'!M38","v":0},{"$f":"'41-państw.inst.kult.'!N38","v":0},{"$f":"'41-państw.inst.kult.'!O38","v":0},{"$f":"'41-państw.inst.kult.'!P38","v":0},{"$f":"'41-państw.inst.kult.'!M39","v":0},{"$f":"'41-państw.inst.kult.'!N39","v":0},{"$f":"'41-państw.inst.kult.'!O39","v":0},{"$f":"'41-państw.inst.kult.'!P39","v":0},{"$f":"'41-państw.inst.kult.'!M40","v":0},{"$f":"'41-państw.inst.kult.'!N40","v":0},{"$f":"'41-państw.inst.kult.'!O40","v":0},{"$f":"'41-państw.inst.kult.'!P40","v":0},{"$f":"'41-państw.inst.kult.'!M41","v":0},{"$f":"'41-państw.inst.kult.'!N41","v":0},{"$f":"'41-państw.inst.kult.'!O41","v":0},{"$f":"'41-państw.inst.kult.'!P41","v":0},{"$f":"'41-państw.inst.kult.'!M42","v":0},{"$f":"'41-państw.inst.kult.'!N42","v":0},{"$f":"'41-państw.inst.kult.'!O42","v":0},{"$f":"'41-państw.inst.kult.'!P42","v":0},{"$f":"'41-państw.inst.kult.'!M43","v":0},{"$f":"'41-państw.inst.kult.'!N43","v":0},{"$f":"'41-państw.inst.kult.'!O43","v":0},{"$f":"'41-państw.inst.kult.'!P43","v":0},{"$f":"'41-państw.inst.kult.'!M44","v":0},{"$f":"'41-państw.inst.kult.'!N44","v":0},{"$f":"'41-państw.inst.kult.'!O44","v":0},{"$f":"'41-państw.inst.kult.'!P44","v":0},{"$f":"'41-państw.inst.kult.'!M45","v":0},{"$f":"'41-państw.inst.kult.'!N45","v":0},{"$f":"'41-państw.inst.kult.'!O45","v":0},{"$f":"'41-państw.inst.kult.'!P45","v":0}]
[{"$f":"'42-samorz.inst.kult.'!A8","v":0},null,null,null,null,{"$f":"'42-samorz.inst.kult.'!L11","v":42},{"$f":"'42-samorz.inst.kult.'!K8","v":0},{"$f":"'42-samorz.inst.kult.'!H8","v":4},{"$f":"'42-samorz.inst.kult.'!M11","v":0},null,null,{"$f":"'42-samorz.inst.kult.'!M33","v":0},{"$f":"'42-samorz.inst.kult.'!N33","v":0},{"$f":"'42-samorz.inst.kult.'!O33","v":0},{"$f":"'42-samorz.inst.kult.'!P33","v":0},{"$f":"'42-samorz.inst.kult.'!M34","v":0},{"$f":"'42-samorz.inst.kult.'!N34","v":0},{"$f":"'42-samorz.inst.kult.'!O34","v":0},{"$f":"'42-samorz.inst.kult.'!P34","v":0},{"$f":"'42-samorz.inst.kult.'!M35","v":0},{"$f":"'42-samorz.inst.kult.'!N35","v":0},{"$f":"'42-samorz.inst.kult.'!O35","v":0},{"$f":"'42-samorz.inst.kult.'!P35","v":0},{"$f":"'42-samorz.inst.kult.'!M36","v":0},{"$f":"'42-samorz.inst.kult.'!N36","v":0},{"$f":"'42-samorz.inst.kult.'!O36","v":0},{"$f":"'42-samorz.inst.kult.'!P36","v":0},{"$f":"'42-samorz.inst.kult.'!M37","v":0},{"$f":"'42-samorz.inst.kult.'!N37","v":0},{"$f":"'42-samorz.inst.kult.'!O37","v":0},{"$f":"'42-samorz.inst.kult.'!P37","v":0},{"$f":"'42-samorz.inst.kult.'!M38","v":0},{"$f":"'42-samorz.inst.kult.'!N38","v":0},{"$f":"'42-samorz.inst.kult.'!O38","v":0},{"$f":"'42-samorz.inst.kult.'!P38","v":0},{"$f":"'42-samorz.inst.kult.'!M39","v":0},{"$f":"'42-samorz.inst.kult.'!N39","v":0},{"$f":"'42-samorz.inst.kult.'!O39","v":0},{"$f":"'42-samorz.inst.kult.'!P39","v":0},{"$f":"'42-samorz.inst.kult.'!M40","v":0},{"$f":"'42-samorz.inst.kult.'!N40","v":0},{"$f":"'42-samorz.inst.kult.'!O40","v":0},{"$f":"'42-samorz.inst.kult.'!P40","v":0},{"$f":"'42-samorz.inst.kult.'!M41","v":0},{"$f":"'42-samorz.inst.kult.'!N41","v":0},{"$f":"'42-samorz.inst.kult.'!O41","v":0},{"$f":"'42-samorz.inst.kult.'!P41","v":0},{"$f":"'42-samorz.inst.kult.'!M42","v":0},{"$f":"'42-samorz.inst.kult.'!N42","v":0},{"$f":"'42-samorz.inst.kult.'!O42","v":0},{"$f":"'42-samorz.inst.kult.'!P42","v":0},{"$f":"'42-samorz.inst.kult.'!M43","v":0},{"$f":"'42-samorz.inst.kult.'!N43","v":0},{"$f":"'42-samorz.inst.kult.'!O43","v":0},{"$f":"'42-samorz.inst.kult.'!P43","v":0},{"$f":"'42-samorz.inst.kult.'!M44","v":0},{"$f":"'42-samorz.inst.kult.'!N44","v":0},{"$f":"'42-samorz.inst.kult.'!O44","v":0},{"$f":"'42-samorz.inst.kult.'!P44","v":0},{"$f":"'42-samorz.inst.kult.'!M45","v":0},{"$f":"'42-samorz.inst.kult.'!N45","v":0},{"$f":"'42-samorz.inst.kult.'!O45","v":0},{"$f":"'42-samorz.inst.kult.'!P45","v":0}]
[{"$f":"'50-PAN i jedn.tworz.przez PAN'!A8","v":0},null,null,null,null,{"$f":"'50-PAN i jedn.tworz.przez PAN'!L11","v":50},{"$f":"'50-PAN i jedn.tworz.przez PAN'!K8","v":0},{"$f":"'50-PAN i jedn.tworz.przez PAN'!H8","v":4},{"$f":"'50-PAN i jedn.tworz.przez PAN'!M11","v":0},null,null,{"$f":"'50-PAN i jedn.tworz.przez PAN'!M33","v":0},{"$f":"'50-PAN i jedn.tworz.przez PAN'!N33","v":0},{"$f":"'50-PAN i jedn.tworz.przez PAN'!O33","v":0},{"$f":"'50-PAN i jedn.tworz.przez PAN'!P33","v":0},{"$f":"'50-PAN i jedn.tworz.przez PAN'!M34","v":0},{"$f":"'50-PAN i jedn.tworz.przez PAN'!N34","v":0},{"$f":"'50-PAN i jedn.tworz.przez PAN'!O34","v":0},{"$f":"'50-PAN i jedn.tworz.przez PAN'!P34","v":0},{"$f":"'50-PAN i jedn.tworz.przez PAN'!M35","v":0},{"$f":"'50-PAN i jedn.tworz.przez PAN'!N35","v":0},{"$f":"'50-PAN i jedn.tworz.przez PAN'!O35","v":0},{"$f":"'50-PAN i jedn.tworz.przez PAN'!P35","v":0},{"$f":"'50-PAN i jedn.tworz.przez PAN'!M36","v":0},{"$f":"'50-PAN i jedn.tworz.przez PAN'!N36","v":0},{"$f":"'50-PAN i jedn.tworz.przez PAN'!O36","v":0},{"$f":"'50-PAN i jedn.tworz.przez PAN'!P36","v":0},{"$f":"'50-PAN i jedn.tworz.przez PAN'!M37","v":0},{"$f":"'50-PAN i jedn.tworz.przez PAN'!N37","v":0},{"$f":"'50-PAN i jedn.tworz.przez PAN'!O37","v":0},{"$f":"'50-PAN i jedn.tworz.przez PAN'!P37","v":0},{"$f":"'50-PAN i jedn.tworz.przez PAN'!M38","v":0},{"$f":"'50-PAN i jedn.tworz.przez PAN'!N38","v":0},{"$f":"'50-PAN i jedn.tworz.przez PAN'!O38","v":0},{"$f":"'50-PAN i jedn.tworz.przez PAN'!P38","v":0},{"$f":"'50-PAN i jedn.tworz.przez PAN'!M39","v":0},{"$f":"'50-PAN i jedn.tworz.przez PAN'!N39","v":0},{"$f":"'50-PAN i jedn.tworz.przez PAN'!O39","v":0},{"$f":"'50-PAN i jedn.tworz.przez PAN'!P39","v":0},{"$f":"'50-PAN i jedn.tworz.przez PAN'!M40","v":0},{"$f":"'50-PAN i jedn.tworz.przez PAN'!N40","v":0},{"$f":"'50-PAN i jedn.tworz.przez PAN'!O40","v":0},{"$f":"'50-PAN i jedn.tworz.przez PAN'!P40","v":0},{"$f":"'50-PAN i jedn.tworz.przez PAN'!M41","v":0},{"$f":"'50-PAN i jedn.tworz.przez PAN'!N41","v":0},{"$f":"'50-PAN i jedn.tworz.przez PAN'!O41","v":0},{"$f":"'50-PAN i jedn.tworz.przez PAN'!P41","v":0},{"$f":"'50-PAN i jedn.tworz.przez PAN'!M42","v":0},{"$f":"'50-PAN i jedn.tworz.przez PAN'!N42","v":0},{"$f":"'50-PAN i jedn.tworz.przez PAN'!O42","v":0},{"$f":"'50-PAN i jedn.tworz.przez PAN'!P42","v":0},{"$f":"'50-PAN i jedn.tworz.przez PAN'!M43","v":0},{"$f":"'50-PAN i jedn.tworz.przez PAN'!N43","v":0},{"$f":"'50-PAN i jedn.tworz.przez PAN'!O43","v":0},{"$f":"'50-PAN i jedn.tworz.przez PAN'!P43","v":0},{"$f":"'50-PAN i jedn.tworz.przez PAN'!M44","v":0},{"$f":"'50-PAN i jedn.tworz.przez PAN'!N44","v":0},{"$f":"'50-PAN i jedn.tworz.przez PAN'!O44","v":0},{"$f":"'50-PAN i jedn.tworz.przez PAN'!P44","v":0},{"$f":"'50-PAN i jedn.tworz.przez PAN'!M45","v":0},{"$f":"'50-PAN i jedn.tworz.przez PAN'!N45","v":0},{"$f":"'50-PAN i jedn.tworz.przez PAN'!O45","v":0},{"$f":"'50-PAN i jedn.tworz.przez PAN'!P45","v":0}]
[{"$f":"'61-samodz.publ.ZOZ państw.'!A8","v":0},null,null,null,null,{"$f":"'61-samodz.publ.ZOZ państw.'!L11","v":61},{"$f":"'61-samodz.publ.ZOZ państw.'!K8","v":0},{"$f":"'61-samodz.publ.ZOZ państw.'!H8","v":4},{"$f":"'61-samodz.publ.ZOZ państw.'!M11","v":0},null,null,{"$f":"'61-samodz.publ.ZOZ państw.'!M33","v":0},{"$f":"'61-samodz.publ.ZOZ państw.'!N33","v":0},{"$f":"'61-samodz.publ.ZOZ państw.'!O33","v":0},{"$f":"'61-samodz.publ.ZOZ państw.'!P33","v":0},{"$f":"'61-samodz.publ.ZOZ państw.'!M34","v":0},{"$f":"'61-samodz.publ.ZOZ państw.'!N34","v":0},{"$f":"'61-samodz.publ.ZOZ państw.'!O34","v":0},{"$f":"'61-samodz.publ.ZOZ państw.'!P34","v":0},{"$f":"'61-samodz.publ.ZOZ państw.'!M35","v":0},{"$f":"'61-samodz.publ.ZOZ państw.'!N35","v":0},{"$f":"'61-samodz.publ.ZOZ państw.'!O35","v":0},{"$f":"'61-samodz.publ.ZOZ państw.'!P35","v":0},{"$f":"'61-samodz.publ.ZOZ państw.'!M36","v":0},{"$f":"'61-samodz.publ.ZOZ państw.'!N36","v":0},{"$f":"'61-samodz.publ.ZOZ państw.'!O36","v":0},{"$f":"'61-samodz.publ.ZOZ państw.'!P36","v":0},{"$f":"'61-samodz.publ.ZOZ państw.'!M37","v":0},{"$f":"'61-samodz.publ.ZOZ państw.'!N37","v":0},{"$f":"'61-samodz.publ.ZOZ państw.'!O37","v":0},{"$f":"'61-samodz.publ.ZOZ państw.'!P37","v":0},{"$f":"'61-samodz.publ.ZOZ państw.'!M38","v":0},{"$f":"'61-samodz.publ.ZOZ państw.'!N38","v":0},{"$f":"'61-samodz.publ.ZOZ państw.'!O38","v":0},{"$f":"'61-samodz.publ.ZOZ państw.'!P38","v":0},{"$f":"'61-samodz.publ.ZOZ państw.'!M39","v":0},{"$f":"'61-samodz.publ.ZOZ państw.'!N39","v":0},{"$f":"'61-samodz.publ.ZOZ państw.'!O39","v":0},{"$f":"'61-samodz.publ.ZOZ państw.'!P39","v":0},{"$f":"'61-samodz.publ.ZOZ państw.'!M40","v":0},{"$f":"'61-samodz.publ.ZOZ państw.'!N40","v":0},{"$f":"'61-samodz.publ.ZOZ państw.'!O40","v":0},{"$f":"'61-samodz.publ.ZOZ państw.'!P40","v":0},{"$f":"'61-samodz.publ.ZOZ państw.'!M41","v":0},{"$f":"'61-samodz.publ.ZOZ państw.'!N41","v":0},{"$f":"'61-samodz.publ.ZOZ państw.'!O41","v":0},{"$f":"'61-samodz.publ.ZOZ państw.'!P41","v":0},{"$f":"'61-samodz.publ.ZOZ państw.'!M42","v":0},{"$f":"'61-samodz.publ.ZOZ państw.'!N42","v":0},{"$f":"'61-samodz.publ.ZOZ państw.'!O42","v":0},{"$f":"'61-samodz.publ.ZOZ państw.'!P42","v":0},{"$f":"'61-samodz.publ.ZOZ państw.'!M43","v":0},{"$f":"'61-samodz.publ.ZOZ państw.'!N43","v":0},{"$f":"'61-samodz.publ.ZOZ państw.'!O43","v":0},{"$f":"'61-samodz.publ.ZOZ państw.'!P43","v":0},{"$f":"'61-samodz.publ.ZOZ państw.'!M44","v":0},{"$f":"'61-samodz.publ.ZOZ państw.'!N44","v":0},{"$f":"'61-samodz.publ.ZOZ państw.'!O44","v":0},{"$f":"'61-samodz.publ.ZOZ państw.'!P44","v":0},{"$f":"'61-samodz.publ.ZOZ państw.'!M45","v":0},{"$f":"'61-samodz.publ.ZOZ państw.'!N45","v":0},{"$f":"'61-samodz.publ.ZOZ państw.'!O45","v":0},{"$f":"'61-samodz.publ.ZOZ państw.'!P45","v":0}]
[{"$f":"'62-samodz.publ.ZOZ samorz.'!A8","v":0},null,null,null,null,{"$f":"'62-samodz.publ.ZOZ samorz.'!L11","v":62},{"$f":"'62-samodz.publ.ZOZ samorz.'!K8","v":0},{"$f":"'62-samodz.publ.ZOZ samorz.'!H8","v":4},{"$f":"'62-samodz.publ.ZOZ samorz.'!M11","v":0},null,null,{"$f":"'62-samodz.publ.ZOZ samorz.'!M33","v":0},{"$f":"'62-samodz.publ.ZOZ samorz.'!N33","v":0},{"$f":"'62-samodz.publ.ZOZ samorz.'!O33","v":0},{"$f":"'62-samodz.publ.ZOZ samorz.'!P33","v":0},{"$f":"'62-samodz.publ.ZOZ samorz.'!M34","v":0},{"$f":"'62-samodz.publ.ZOZ samorz.'!N34","v":0},{"$f":"'62-samodz.publ.ZOZ samorz.'!O34","v":0},{"$f":"'62-samodz.publ.ZOZ samorz.'!P34","v":0},{"$f":"'62-samodz.publ.ZOZ samorz.'!M35","v":0},{"$f":"'62-samodz.publ.ZOZ samorz.'!N35","v":0},{"$f":"'62-samodz.publ.ZOZ samorz.'!O35","v":0},{"$f":"'62-samodz.publ.ZOZ samorz.'!P35","v":0},{"$f":"'62-samodz.publ.ZOZ samorz.'!M36","v":0},{"$f":"'62-samodz.publ.ZOZ samorz.'!N36","v":0},{"$f":"'62-samodz.publ.ZOZ samorz.'!O36","v":0},{"$f":"'62-samodz.publ.ZOZ samorz.'!P36","v":0},{"$f":"'62-samodz.publ.ZOZ samorz.'!M37","v":0},{"$f":"'62-samodz.publ.ZOZ samorz.'!N37","v":0},{"$f":"'62-samodz.publ.ZOZ samorz.'!O37","v":0},{"$f":"'62-samodz.publ.ZOZ samorz.'!P37","v":0},{"$f":"'62-samodz.publ.ZOZ samorz.'!M38","v":0},{"$f":"'62-samodz.publ.ZOZ samorz.'!N38","v":0},{"$f":"'62-samodz.publ.ZOZ samorz.'!O38","v":0},{"$f":"'62-samodz.publ.ZOZ samorz.'!P38","v":0},{"$f":"'62-samodz.publ.ZOZ samorz.'!M39","v":0},{"$f":"'62-samodz.publ.ZOZ samorz.'!N39","v":0},{"$f":"'62-samodz.publ.ZOZ samorz.'!O39","v":0},{"$f":"'62-samodz.publ.ZOZ samorz.'!P39","v":0},{"$f":"'62-samodz.publ.ZOZ samorz.'!M40","v":0},{"$f":"'62-samodz.publ.ZOZ samorz.'!N40","v":0},{"$f":"'62-samodz.publ.ZOZ samorz.'!O40","v":0},{"$f":"'62-samodz.publ.ZOZ samorz.'!P40","v":0},{"$f":"'62-samodz.publ.ZOZ samorz.'!M41","v":0},{"$f":"'62-samodz.publ.ZOZ samorz.'!N41","v":0},{"$f":"'62-samodz.publ.ZOZ samorz.'!O41","v":0},{"$f":"'62-samodz.publ.ZOZ samorz.'!P41","v":0},{"$f":"'62-samodz.publ.ZOZ samorz.'!M42","v":0},{"$f":"'62-samodz.publ.ZOZ samorz.'!N42","v":0},{"$f":"'62-samodz.publ.ZOZ samorz.'!O42","v":0},{"$f":"'62-samodz.publ.ZOZ samorz.'!P42","v":0},{"$f":"'62-samodz.publ.ZOZ samorz.'!M43","v":0},{"$f":"'62-samodz.publ.ZOZ samorz.'!N43","v":0},{"$f":"'62-samodz.publ.ZOZ samorz.'!O43","v":0},{"$f":"'62-samodz.publ.ZOZ samorz.'!P43","v":0},{"$f":"'62-samodz.publ.ZOZ samorz.'!M44","v":0},{"$f":"'62-samodz.publ.ZOZ samorz.'!N44","v":0},{"$f":"'62-samodz.publ.ZOZ samorz.'!O44","v":0},{"$f":"'62-samodz.publ.ZOZ samorz.'!P44","v":0},{"$f":"'62-samodz.publ.ZOZ samorz.'!M45","v":0},{"$f":"'62-samodz.publ.ZOZ samorz.'!N45","v":0},{"$f":"'62-samodz.publ.ZOZ samorz.'!O45","v":0},{"$f":"'62-samodz.publ.ZOZ samorz.'!P45","v":0}]
[{"$f":"'63-Narodowy Fundusz Zdrowia'!A8","v":0},null,null,null,null,{"$f":"'63-Narodowy Fundusz Zdrowia'!L11","v":63},{"$f":"'63-Narodowy Fundusz Zdrowia'!K8","v":0},{"$f":"'63-Narodowy Fundusz Zdrowia'!H8","v":4},{"$f":"'63-Narodowy Fundusz Zdrowia'!M11","v":0},null,null,{"$f":"'63-Narodowy Fundusz Zdrowia'!M33","v":0},{"$f":"'63-Narodowy Fundusz Zdrowia'!N33","v":0},{"$f":"'63-Narodowy Fundusz Zdrowia'!O33","v":0},{"$f":"'63-Narodowy Fundusz Zdrowia'!P33","v":0},{"$f":"'63-Narodowy Fundusz Zdrowia'!M34","v":0},{"$f":"'63-Narodowy Fundusz Zdrowia'!N34","v":0},{"$f":"'63-Narodowy Fundusz Zdrowia'!O34","v":0},{"$f":"'63-Narodowy Fundusz Zdrowia'!P34","v":0},{"$f":"'63-Narodowy Fundusz Zdrowia'!M35","v":0},{"$f":"'63-Narodowy Fundusz Zdrowia'!N35","v":0},{"$f":"'63-Narodowy Fundusz Zdrowia'!O35","v":0},{"$f":"'63-Narodowy Fundusz Zdrowia'!P35","v":0},{"$f":"'63-Narodowy Fundusz Zdrowia'!M36","v":0},{"$f":"'63-Narodowy Fundusz Zdrowia'!N36","v":0},{"$f":"'63-Narodowy Fundusz Zdrowia'!O36","v":0},{"$f":"'63-Narodowy Fundusz Zdrowia'!P36","v":0},{"$f":"'63-Narodowy Fundusz Zdrowia'!M37","v":0},{"$f":"'63-Narodowy Fundusz Zdrowia'!N37","v":0},{"$f":"'63-Narodowy Fundusz Zdrowia'!O37","v":0},{"$f":"'63-Narodowy Fundusz Zdrowia'!P37","v":0},{"$f":"'63-Narodowy Fundusz Zdrowia'!M38","v":0},{"$f":"'63-Narodowy Fundusz Zdrowia'!N38","v":0},{"$f":"'63-Narodowy Fundusz Zdrowia'!O38","v":0},{"$f":"'63-Narodowy Fundusz Zdrowia'!P38","v":0},{"$f":"'63-Narodowy Fundusz Zdrowia'!M39","v":0},{"$f":"'63-Narodowy Fundusz Zdrowia'!N39","v":0},{"$f":"'63-Narodowy Fundusz Zdrowia'!O39","v":0},{"$f":"'63-Narodowy Fundusz Zdrowia'!P39","v":0},{"$f":"'63-Narodowy Fundusz Zdrowia'!M40","v":0},{"$f":"'63-Narodowy Fundusz Zdrowia'!N40","v":0},{"$f":"'63-Narodowy Fundusz Zdrowia'!O40","v":0},{"$f":"'63-Narodowy Fundusz Zdrowia'!P40","v":0},{"$f":"'63-Narodowy Fundusz Zdrowia'!M41","v":0},{"$f":"'63-Narodowy Fundusz Zdrowia'!N41","v":0},{"$f":"'63-Narodowy Fundusz Zdrowia'!O41","v":0},{"$f":"'63-Narodowy Fundusz Zdrowia'!P41","v":0},{"$f":"'63-Narodowy Fundusz Zdrowia'!M42","v":0},{"$f":"'63-Narodowy Fundusz Zdrowia'!N42","v":0},{"$f":"'63-Narodowy Fundusz Zdrowia'!O42","v":0},{"$f":"'63-Narodowy Fundusz Zdrowia'!P42","v":0},{"$f":"'63-Narodowy Fundusz Zdrowia'!M43","v":0},{"$f":"'63-Narodowy Fundusz Zdrowia'!N43","v":0},{"$f":"'63-Narodowy Fundusz Zdrowia'!O43","v":0},{"$f":"'63-Narodowy Fundusz Zdrowia'!P43","v":0},{"$f":"'63-Narodowy Fundusz Zdrowia'!M44","v":0},{"$f":"'63-Narodowy Fundusz Zdrowia'!N44","v":0},{"$f":"'63-Narodowy Fundusz Zdrowia'!O44","v":0},{"$f":"'63-Narodowy Fundusz Zdrowia'!P44","v":0},{"$f":"'63-Narodowy Fundusz Zdrowia'!M45","v":0},{"$f":"'63-Narodowy Fundusz Zdrowia'!N45","v":0},{"$f":"'63-Narodowy Fundusz Zdrowia'!O45","v":0},{"$f":"'63-Narodowy Fundusz Zdrowia'!P45","v":0}]
[{"$f":"'71-ZUS'!A8","v":0},null,null,null,null,{"$f":"'71-ZUS'!L11","v":71},{"$f":"'71-ZUS'!K8","v":0},{"$f":"'71-ZUS'!H8","v":4},{"$f":"'71-ZUS'!M11","v":0},null,null,{"$f":"'71-ZUS'!M33","v":0},{"$f":"'71-ZUS'!N33","v":0},{"$f":"'71-ZUS'!O33","v":0},{"$f":"'71-ZUS'!P33","v":0},{"$f":"'71-ZUS'!M34","v":0},{"$f":"'71-ZUS'!N34","v":0},{"$f":"'71-ZUS'!O34","v":0},{"$f":"'71-ZUS'!P34","v":0},{"$f":"'71-ZUS'!M35","v":0},{"$f":"'71-ZUS'!N35","v":0},{"$f":"'71-ZUS'!O35","v":0},{"$f":"'71-ZUS'!P35","v":0},{"$f":"'71-ZUS'!M36","v":0},{"$f":"'71-ZUS'!N36","v":0},{"$f":"'71-ZUS'!O36","v":0},{"$f":"'71-ZUS'!P36","v":0},{"$f":"'71-ZUS'!M37","v":0},{"$f":"'71-ZUS'!N37","v":0},{"$f":"'71-ZUS'!O37","v":0},{"$f":"'71-ZUS'!P37","v":0},{"$f":"'71-ZUS'!M38","v":0},{"$f":"'71-ZUS'!N38","v":0},{"$f":"'71-ZUS'!O38","v":0},{"$f":"'71-ZUS'!P38","v":0},{"$f":"'71-ZUS'!M39","v":0},{"$f":"'71-ZUS'!N39","v":0},{"$f":"'71-ZUS'!O39","v":0},{"$f":"'71-ZUS'!P39","v":0},{"$f":"'71-ZUS'!M40","v":0},{"$f":"'71-ZUS'!N40","v":0},{"$f":"'71-ZUS'!O40","v":0},{"$f":"'71-ZUS'!P40","v":0},{"$f":"'71-ZUS'!M41","v":0},{"$f":"'71-ZUS'!N41","v":0},{"$f":"'71-ZUS'!O41","v":0},{"$f":"'71-ZUS'!P41","v":0},{"$f":"'71-ZUS'!M42","v":0},{"$f":"'71-ZUS'!N42","v":0},{"$f":"'71-ZUS'!O42","v":0},{"$f":"'71-ZUS'!P42","v":0},{"$f":"'71-ZUS'!M43","v":0},{"$f":"'71-ZUS'!N43","v":0},{"$f":"'71-ZUS'!O43","v":0},{"$f":"'71-ZUS'!P43","v":0},{"$f":"'71-ZUS'!M44","v":0},{"$f":"'71-ZUS'!N44","v":0},{"$f":"'71-ZUS'!O44","v":0},{"$f":"'71-ZUS'!P44","v":0},{"$f":"'71-ZUS'!M45","v":0},{"$f":"'71-ZUS'!N45","v":0},{"$f":"'71-ZUS'!O45","v":0},{"$f":"'71-ZUS'!P45","v":0}]
[{"$f":"'72-fund.zarz.przez ZUS'!A8:B8","v":0},null,null,null,null,{"$f":"'72-fund.zarz.przez ZUS'!L11","v":72},{"$f":"'72-fund.zarz.przez ZUS'!K8","v":0},{"$f":"'72-fund.zarz.przez ZUS'!H8","v":4},{"$f":"'72-fund.zarz.przez ZUS'!M11","v":0},null,null,{"$f":"'72-fund.zarz.przez ZUS'!M33","v":0},{"$f":"'72-fund.zarz.przez ZUS'!N33","v":0},{"$f":"'72-fund.zarz.przez ZUS'!O33","v":0},{"$f":"'72-fund.zarz.przez ZUS'!P33","v":0},{"$f":"'72-fund.zarz.przez ZUS'!M34","v":0},{"$f":"'72-fund.zarz.przez ZUS'!N34","v":0},{"$f":"'72-fund.zarz.przez ZUS'!O34","v":0},{"$f":"'72-fund.zarz.przez ZUS'!P34","v":0},{"$f":"'72-fund.zarz.przez ZUS'!M35","v":0},{"$f":"'72-fund.zarz.przez ZUS'!N35","v":0},{"$f":"'72-fund.zarz.przez ZUS'!O35","v":0},{"$f":"'72-fund.zarz.przez ZUS'!P35","v":0},{"$f":"'72-fund.zarz.przez ZUS'!M36","v":0},{"$f":"'72-fund.zarz.przez ZUS'!N36","v":0},{"$f":"'72-fund.zarz.przez ZUS'!O36","v":0},{"$f":"'72-fund.zarz.przez ZUS'!P36","v":0},{"$f":"'72-fund.zarz.przez ZUS'!M37","v":0},{"$f":"'72-fund.zarz.przez ZUS'!N37","v":0},{"$f":"'72-fund.zarz.przez ZUS'!O37","v":0},{"$f":"'72-fund.zarz.przez ZUS'!P37","v":0},{"$f":"'72-fund.zarz.przez ZUS'!M38","v":0},{"$f":"'72-fund.zarz.przez ZUS'!N38","v":0},{"$f":"'72-fund.zarz.przez ZUS'!O38","v":0},{"$f":"'72-fund.zarz.przez ZUS'!P38","v":0},{"$f":"'72-fund.zarz.przez ZUS'!M39","v":0},{"$f":"'72-fund.zarz.przez ZUS'!N39","v":0},{"$f":"'72-fund.zarz.przez ZUS'!O39","v":0},{"$f":"'72-fund.zarz.przez ZUS'!P39","v":0},{"$f":"'72-fund.zarz.przez ZUS'!M40","v":0},{"$f":"'72-fund.zarz.przez ZUS'!N40","v":0},{"$f":"'72-fund.zarz.przez ZUS'!O40","v":0},{"$f":"'72-fund.zarz.przez ZUS'!P40","v":0},{"$f":"'72-fund.zarz.przez ZUS'!M41","v":0},{"$f":"'72-fund.zarz.przez ZUS'!N41","v":0},{"$f":"'72-fund.zarz.przez ZUS'!O41","v":0},{"$f":"'72-fund.zarz.przez ZUS'!P41","v":0},{"$f":"'72-fund.zarz.przez ZUS'!M42","v":0},{"$f":"'72-fund.zarz.przez ZUS'!N42","v":0},{"$f":"'72-fund.zarz.przez ZUS'!O42","v":0},{"$f":"'72-fund.zarz.przez ZUS'!P42","v":0},{"$f":"'72-fund.zarz.przez ZUS'!M43","v":0},{"$f":"'72-fund.zarz.przez ZUS'!N43","v":0},{"$f":"'72-fund.zarz.przez ZUS'!O43","v":0},{"$f":"'72-fund.zarz.przez ZUS'!P43","v":0},{"$f":"'72-fund.zarz.przez ZUS'!M44","v":0},{"$f":"'72-fund.zarz.przez ZUS'!N44","v":0},{"$f":"'72-fund.zarz.przez ZUS'!O44","v":0},{"$f":"'72-fund.zarz.przez ZUS'!P44","v":0},{"$f":"'72-fund.zarz.przez ZUS'!M45","v":0},{"$f":"'72-fund.zarz.przez ZUS'!N45","v":0},{"$f":"'72-fund.zarz.przez ZUS'!O45","v":0},{"$f":"'72-fund.zarz.przez ZUS'!P45","v":0}]
[{"$f":"'73-KRUS'!A8:B8","v":0},null,null,null,null,{"$f":"'73-KRUS'!L11","v":73},{"$f":"'73-KRUS'!K8","v":0},{"$f":"'73-KRUS'!H8","v":4},{"$f":"'73-KRUS'!M11","v":0},null,null,{"$f":"'73-KRUS'!M33","v":0},{"$f":"'73-KRUS'!N33","v":0},{"$f":"'73-KRUS'!O33","v":0},{"$f":"'73-KRUS'!P33","v":0},{"$f":"'73-KRUS'!M34","v":0},{"$f":"'73-KRUS'!N34","v":0},{"$f":"'73-KRUS'!O34","v":0},{"$f":"'73-KRUS'!P34","v":0},{"$f":"'73-KRUS'!M35","v":0},{"$f":"'73-KRUS'!N35","v":0},{"$f":"'73-KRUS'!O35","v":0},{"$f":"'73-KRUS'!P35","v":0},{"$f":"'73-KRUS'!M36","v":0},{"$f":"'73-KRUS'!N36","v":0},{"$f":"'73-KRUS'!O36","v":0},{"$f":"'73-KRUS'!P36","v":0},{"$f":"'73-KRUS'!M37","v":0},{"$f":"'73-KRUS'!N37","v":0},{"$f":"'73-KRUS'!O37","v":0},{"$f":"'73-KRUS'!P37","v":0},{"$f":"'73-KRUS'!M38","v":0},{"$f":"'73-KRUS'!N38","v":0},{"$f":"'73-KRUS'!O38","v":0},{"$f":"'73-KRUS'!P38","v":0},{"$f":"'73-KRUS'!M39","v":0},{"$f":"'73-KRUS'!N39","v":0},{"$f":"'73-KRUS'!O39","v":0},{"$f":"'73-KRUS'!P39","v":0},{"$f":"'73-KRUS'!M40","v":0},{"$f":"'73-KRUS'!N40","v":0},{"$f":"'73-KRUS'!O40","v":0},{"$f":"'73-KRUS'!P40","v":0},{"$f":"'73-KRUS'!M41","v":0},{"$f":"'73-KRUS'!N41","v":0},{"$f":"'73-KRUS'!O41","v":0},{"$f":"'73-KRUS'!P41","v":0},{"$f":"'73-KRUS'!M42","v":0},{"$f":"'73-KRUS'!N42","v":0},{"$f":"'73-KRUS'!O42","v":0},{"$f":"'73-KRUS'!P42","v":0},{"$f":"'73-KRUS'!M43","v":0},{"$f":"'73-KRUS'!N43","v":0},{"$f":"'73-KRUS'!O43","v":0},{"$f":"'73-KRUS'!P43","v":0},{"$f":"'73-KRUS'!M44","v":0},{"$f":"'73-KRUS'!N44","v":0},{"$f":"'73-KRUS'!O44","v":0},{"$f":"'73-KRUS'!P44","v":0},{"$f":"'73-KRUS'!M45","v":0},{"$f":"'73-KRUS'!N45","v":0},{"$f":"'73-KRUS'!O45","v":0},{"$f":"'73-KRUS'!P45","v":0}]
[{"$f":"'81-państw.osoba prawna'!A8","v":0},null,null,null,null,{"$f":"'81-państw.osoba prawna'!L11","v":81},{"$f":"'81-państw.osoba prawna'!K8","v":0},{"$f":"'81-państw.osoba prawna'!H8","v":4},{"$f":"'81-państw.osoba prawna'!M11","v":0},null,null,{"$f":"'81-państw.osoba prawna'!M33","v":0},{"$f":"'81-państw.osoba prawna'!N33","v":0},{"$f":"'81-państw.osoba prawna'!O33","v":0},{"$f":"'81-państw.osoba prawna'!P33","v":0},{"$f":"'81-państw.osoba prawna'!M34","v":0},{"$f":"'81-państw.osoba prawna'!N34","v":0},{"$f":"'81-państw.osoba prawna'!O34","v":0},{"$f":"'81-państw.osoba prawna'!P34","v":0},{"$f":"'81-państw.osoba prawna'!M35","v":0},{"$f":"'81-państw.osoba prawna'!N35","v":0},{"$f":"'81-państw.osoba prawna'!O35","v":0},{"$f":"'81-państw.osoba prawna'!P35","v":0},{"$f":"'81-państw.osoba prawna'!M36","v":0},{"$f":"'81-państw.osoba prawna'!N36","v":0},{"$f":"'81-państw.osoba prawna'!O36","v":0},{"$f":"'81-państw.osoba prawna'!P36","v":0},{"$f":"'81-państw.osoba prawna'!M37","v":0},{"$f":"'81-państw.osoba prawna'!N37","v":0},{"$f":"'81-państw.osoba prawna'!O37","v":0},{"$f":"'81-państw.osoba prawna'!P37","v":0},{"$f":"'81-państw.osoba prawna'!M38","v":0},{"$f":"'81-państw.osoba prawna'!N38","v":0},{"$f":"'81-państw.osoba prawna'!O38","v":0},{"$f":"'81-państw.osoba prawna'!P38","v":0},{"$f":"'81-państw.osoba prawna'!M39","v":0},{"$f":"'81-państw.osoba prawna'!N39","v":0},{"$f":"'81-państw.osoba prawna'!O39","v":0},{"$f":"'81-państw.osoba prawna'!P39","v":0},{"$f":"'81-państw.osoba prawna'!M40","v":0},{"$f":"'81-państw.osoba prawna'!N40","v":0},{"$f":"'81-państw.osoba prawna'!O40","v":0},{"$f":"'81-państw.osoba prawna'!P40","v":0},{"$f":"'81-państw.osoba prawna'!M41","v":0},{"$f":"'81-państw.osoba prawna'!N41","v":0},{"$f":"'81-państw.osoba prawna'!O41","v":0},{"$f":"'81-państw.osoba prawna'!P41","v":0},{"$f":"'81-państw.osoba prawna'!M42","v":0},{"$f":"'81-państw.osoba prawna'!N42","v":0},{"$f":"'81-państw.osoba prawna'!O42","v":0},{"$f":"'81-państw.osoba prawna'!P42","v":0},{"$f":"'81-państw.osoba prawna'!M43","v":0},{"$f":"'81-państw.osoba prawna'!N43","v":0},{"$f":"'81-państw.osoba prawna'!O43","v":0},{"$f":"'81-państw.osoba prawna'!P43","v":0},{"$f":"'81-państw.osoba prawna'!M44","v":0},{"$f":"'81-państw.osoba prawna'!N44","v":0},{"$f":"'81-państw.osoba prawna'!O44","v":0},{"$f":"'81-państw.osoba prawna'!P44","v":0},{"$f":"'81-państw.osoba prawna'!M45","v":0},{"$f":"'81-państw.osoba prawna'!N45","v":0},{"$f":"'81-państw.osoba prawna'!O45","v":0},{"$f":"'81-państw.osoba prawna'!P45","v":0}]
[{"$f":"'82-samorz.osoba prawna'!A8","v":0},null,null,null,null,{"$f":"'82-samorz.osoba prawna'!L11","v":82},{"$f":"'82-samorz.osoba prawna'!K8","v":0},{"$f":"'82-samorz.osoba prawna'!H8","v":4},{"$f":"'82-samorz.osoba prawna'!M11","v":0},null,null,{"$f":"'82-samorz.osoba prawna'!M33","v":0},{"$f":"'82-samorz.osoba prawna'!N33","v":0},{"$f":"'82-samorz.osoba prawna'!O33","v":0},{"$f":"'82-samorz.osoba prawna'!P33","v":0},{"$f":"'82-samorz.osoba prawna'!M34","v":0},{"$f":"'82-samorz.osoba prawna'!N34","v":0},{"$f":"'82-samorz.osoba prawna'!O34","v":0},{"$f":"'82-samorz.osoba prawna'!P34","v":0},{"$f":"'82-samorz.osoba prawna'!M35","v":0},{"$f":"'82-samorz.osoba prawna'!N35","v":0},{"$f":"'82-samorz.osoba prawna'!O35","v":0},{"$f":"'82-samorz.osoba prawna'!P35","v":0},{"$f":"'82-samorz.osoba prawna'!M36","v":0},{"$f":"'82-samorz.osoba prawna'!N36","v":0},{"$f":"'82-samorz.osoba prawna'!O36","v":0},{"$f":"'82-samorz.osoba prawna'!P36","v":0},{"$f":"'82-samorz.osoba prawna'!M37","v":0},{"$f":"'82-samorz.osoba prawna'!N37","v":0},{"$f":"'82-samorz.osoba prawna'!O37","v":0},{"$f":"'82-samorz.osoba prawna'!P37","v":0},{"$f":"'82-samorz.osoba prawna'!M38","v":0},{"$f":"'82-samorz.osoba prawna'!N38","v":0},{"$f":"'82-samorz.osoba prawna'!O38","v":0},{"$f":"'82-samorz.osoba prawna'!P38","v":0},{"$f":"'82-samorz.osoba prawna'!M39","v":0},{"$f":"'82-samorz.osoba prawna'!N39","v":0},{"$f":"'82-samorz.osoba prawna'!O39","v":0},{"$f":"'82-samorz.osoba prawna'!P39","v":0},{"$f":"'82-samorz.osoba prawna'!M40","v":0},{"$f":"'82-samorz.osoba prawna'!N40","v":0},{"$f":"'82-samorz.osoba prawna'!O40","v":0},{"$f":"'82-samorz.osoba prawna'!P40","v":0},{"$f":"'82-samorz.osoba prawna'!M41","v":0},{"$f":"'82-samorz.osoba prawna'!N41","v":0},{"$f":"'82-samorz.osoba prawna'!O41","v":0},{"$f":"'82-samorz.osoba prawna'!P41","v":0},{"$f":"'82-samorz.osoba prawna'!M42","v":0},{"$f":"'82-samorz.osoba prawna'!N42","v":0},{"$f":"'82-samorz.osoba prawna'!O42","v":0},{"$f":"'82-samorz.osoba prawna'!P42","v":0},{"$f":"'82-samorz.osoba prawna'!M43","v":0},{"$f":"'82-samorz.osoba prawna'!N43","v":0},{"$f":"'82-samorz.osoba prawna'!O43","v":0},{"$f":"'82-samorz.osoba prawna'!P43","v":0},{"$f":"'82-samorz.osoba prawna'!M44","v":0},{"$f":"'82-samorz.osoba prawna'!N44","v":0},{"$f":"'82-samorz.osoba prawna'!O44","v":0},{"$f":"'82-samorz.osoba prawna'!P44","v":0},{"$f":"'82-samorz.osoba prawna'!M45","v":0},{"$f":"'82-samorz.osoba prawna'!N45","v":0},{"$f":"'82-samorz.osoba prawna'!O45","v":0},{"$f":"'82-samorz.osoba prawna'!P45","v":0}]
[{"$f":"'90-agencja wykonawcza'!A8","v":0},null,null,null,null,{"$f":"'90-agencja wykonawcza'!L11","v":90},{"$f":"'90-agencja wykonawcza'!K8","v":0},{"$f":"'90-agencja wykonawcza'!H8","v":4},{"$f":"'90-agencja wykonawcza'!M11","v":0},null,null,{"$f":"'90-agencja wykonawcza'!M33","v":0},{"$f":"'90-agencja wykonawcza'!N33","v":0},{"$f":"'90-agencja wykonawcza'!O33","v":0},{"$f":"'90-agencja wykonawcza'!P33","v":0},{"$f":"'90-agencja wykonawcza'!M34","v":0},{"$f":"'90-agencja wykonawcza'!N34","v":0},{"$f":"'90-agencja wykonawcza'!O34","v":0},{"$f":"'90-agencja wykonawcza'!P34","v":0},{"$f":"'90-agencja wykonawcza'!M35","v":0},{"$f":"'90-agencja wykonawcza'!N35","v":0},{"$f":"'90-agencja wykonawcza'!O35","v":0},{"$f":"'90-agencja wykonawcza'!P35","v":0},{"$f":"'90-agencja wykonawcza'!M36","v":0},{"$f":"'90-agencja wykonawcza'!N36","v":0},{"$f":"'90-agencja wykonawcza'!O36","v":0},{"$f":"'90-agencja wykonawcza'!P36","v":0},{"$f":"'90-agencja wykonawcza'!M37","v":0},{"$f":"'90-agencja wykonawcza'!N37","v":0},{"$f":"'90-agencja wykonawcza'!O37","v":0},{"$f":"'90-agencja wykonawcza'!P37","v":0},{"$f":"'90-agencja wykonawcza'!M38","v":0},{"$f":"'90-agencja wykonawcza'!N38","v":0},{"$f":"'90-agencja wykonawcza'!O38","v":0},{"$f":"'90-agencja wykonawcza'!P38","v":0},{"$f":"'90-agencja wykonawcza'!M39","v":0},{"$f":"'90-agencja wykonawcza'!N39","v":0},{"$f":"'90-agencja wykonawcza'!O39","v":0},{"$f":"'90-agencja wykonawcza'!P39","v":0},{"$f":"'90-agencja wykonawcza'!M40","v":0},{"$f":"'90-agencja wykonawcza'!N40","v":0},{"$f":"'90-agencja wykonawcza'!O40","v":0},{"$f":"'90-agencja wykonawcza'!P40","v":0},{"$f":"'90-agencja wykonawcza'!M41","v":0},{"$f":"'90-agencja wykonawcza'!N41","v":0},{"$f":"'90-agencja wykonawcza'!O41","v":0},{"$f":"'90-agencja wykonawcza'!P41","v":0},{"$f":"'90-agencja wykonawcza'!M42","v":0},{"$f":"'90-agencja wykonawcza'!N42","v":0},{"$f":"'90-agencja wykonawcza'!O42","v":0},{"$f":"'90-agencja wykonawcza'!P42","v":0},{"$f":"'90-agencja wykonawcza'!M43","v":0},{"$f":"'90-agencja wykonawcza'!N43","v":0},{"$f":"'90-agencja wykonawcza'!O43","v":0},{"$f":"'90-agencja wykonawcza'!P43","v":0},{"$f":"'90-agencja wykonawcza'!M44","v":0},{"$f":"'90-agencja wykonawcza'!N44","v":0},{"$f":"'90-agencja wykonawcza'!O44","v":0},{"$f":"'90-agencja wykonawcza'!P44","v":0},{"$f":"'90-agencja wykonawcza'!M45","v":0},{"$f":"'90-agencja wykonawcza'!N45","v":0},{"$f":"'90-agencja wykonawcza'!O45","v":0},{"$f":"'90-agencja wykonawcza'!P45","v":0}]
[{"$f":"'99-zbiorczo'!A8","v":"Brak nr REGON"},null,null,null,null,{"$f":"'99-zbiorczo'!L11","v":99},{"$f":"'99-zbiorczo'!K8","v":"Brak roku"},{"$f":"'99-zbiorczo'!H8","v":4},{"$f":"'99-zbiorczo'!M11","v":0},null,null,{"$f":"'99-zbiorczo'!M33","v":0},{"$f":"'99-zbiorczo'!N33","v":0},{"$f":"'99-zbiorczo'!O33","v":0},{"$f":"'99-zbiorczo'!P33","v":0},{"$f":"'99-zbiorczo'!M34","v":0},{"$f":"'99-zbiorczo'!N34","v":0},{"$f":"'99-zbiorczo'!O34","v":0},{"$f":"'99-zbiorczo'!P34","v":0},{"$f":"'99-zbiorczo'!M35","v":0},{"$f":"'99-zbiorczo'!N35","v":0},{"$f":"'99-zbiorczo'!O35","v":0},{"$f":"'99-zbiorczo'!P35","v":0},{"$f":"'99-zbiorczo'!M36","v":0},{"$f":"'99-zbiorczo'!N36","v":0},{"$f":"'99-zbiorczo'!O36","v":0},{"$f":"'99-zbiorczo'!P36","v":0},{"$f":"'99-zbiorczo'!M37","v":0},{"$f":"'99-zbiorczo'!N37","v":0},{"$f":"'99-zbiorczo'!O37","v":0},{"$f":"'99-zbiorczo'!P37","v":0},{"$f":"'99-zbiorczo'!M38","v":0},{"$f":"'99-zbiorczo'!N38","v":0},{"$f":"'99-zbiorczo'!O38","v":0},{"$f":"'99-zbiorczo'!P38","v":0},{"$f":"'99-zbiorczo'!M39","v":0},{"$f":"'99-zbiorczo'!N39","v":0},{"$f":"'99-zbiorczo'!O39","v":0},{"$f":"'99-zbiorczo'!P39","v":0},{"$f":"'99-zbiorczo'!M40","v":0},{"$f":"'99-zbiorczo'!N40","v":0},{"$f":"'99-zbiorczo'!O40","v":0},{"$f":"'99-zbiorczo'!P40","v":0},{"$f":"'99-zbiorczo'!M41","v":0},{"$f":"'99-zbiorczo'!N41","v":0},{"$f":"'99-zbiorczo'!O41","v":0},{"$f":"'99-zbiorczo'!P41","v":0},{"$f":"'99-zbiorczo'!M42","v":0},{"$f":"'99-zbiorczo'!N42","v":0},{"$f":"'99-zbiorczo'!O42","v":0},{"$f":"'99-zbiorczo'!P42","v":0},{"$f":"'99-zbiorczo'!M43","v":0},{"$f":"'99-zbiorczo'!N43","v":0},{"$f":"'99-zbiorczo'!O43","v":0},{"$f":"'99-zbiorczo'!P43","v":0},{"$f":"'99-zbiorczo'!M44","v":0},{"$f":"'99-zbiorczo'!N44","v":0},{"$f":"'99-zbiorczo'!O44","v":0},{"$f":"'99-zbiorczo'!P44","v":0},{"$f":"'99-zbiorczo'!M45","v":0},{"$f":"'99-zbiorczo'!N45","v":0},{"$f":"'99-zbiorczo'!O45","v":0},{"$f":"'99-zbiorczo'!P45","v":0}]

{"sheet":"RBUZB3","index":19,"n_rows":17,"n_cols":63,"rows_kept":17,"cut":false,"hidden":true,"merged":[]}
["REGON","WK","PK","GK","GT","PT","ROK","KWARTAL","CZ_BU","DAT_SKW","UWAGI","B30102","B30103","B30104","B30105","B30202","B30203","B30204","B30205","B30302","B30303","B30304","B30305","B30402","B30403","B30404","B30405","B30502","B30503","B30504","B30505","B30602","B30603","B30604","B30605","B30702","B30703","B30704","B30705","B30802","B30803","B30804","B30805","B30902","B30903","B30904","B30905","B31002","B31003","B31004","B31005","B31102","B31103","B31104","B31105","B31202","B31203","B31204","B31205","B31302","B31303","B31304","B31305"]
[{"$f":"'11-państw.fund.cel.'!A8","v":0},null,null,null,null,{"$f":"'11-państw.fund.cel.'!L11","v":11},{"$f":"'11-państw.fund.cel.'!K8","v":0},{"$f":"'11-państw.fund.cel.'!H8","v":4},{"$f":"'11-państw.fund.cel.'!M11","v":0},null,null,{"$f":"'11-państw.fund.cel.'!D53","v":0},{"$f":"'11-państw.fund.cel.'!E53","v":0},{"$f":"'11-państw.fund.cel.'!F53","v":0},{"$f":"'11-państw.fund.cel.'!G53","v":0},{"$f":"'11-państw.fund.cel.'!D54","v":0},{"$f":"'11-państw.fund.cel.'!E54","v":0},{"$f":"'11-państw.fund.cel.'!F54","v":0},{"$f":"'11-państw.fund.cel.'!G54","v":0},{"$f":"'11-państw.fund.cel.'!D55","v":0},{"$f":"'11-państw.fund.cel.'!E55","v":0},{"$f":"'11-państw.fund.cel.'!F55","v":0},{"$f":"'11-państw.fund.cel.'!G55","v":0},{"$f":"'11-państw.fund.cel.'!D56","v":0},{"$f":"'11-państw.fund.cel.'!E56","v":0},{"$f":"'11-państw.fund.cel.'!F56","v":0},{"$f":"'11-państw.fund.cel.'!G56","v":0},{"$f":"'11-państw.fund.cel.'!D57","v":0},{"$f":"'11-państw.fund.cel.'!E57","v":0},{"$f":"'11-państw.fund.cel.'!F57","v":0},{"$f":"'11-państw.fund.cel.'!G57","v":0},{"$f":"'11-państw.fund.cel.'!D58","v":0},{"$f":"'11-państw.fund.cel.'!E58","v":0},{"$f":"'11-państw.fund.cel.'!F58","v":0},{"$f":"'11-państw.fund.cel.'!G58","v":0},{"$f":"'11-państw.fund.cel.'!D59","v":0},{"$f":"'11-państw.fund.cel.'!E59","v":0},{"$f":"'11-państw.fund.cel.'!F59","v":0},{"$f":"'11-państw.fund.cel.'!G59","v":0},{"$f":"'11-państw.fund.cel.'!D60","v":0},{"$f":"'11-państw.fund.cel.'!E60","v":0},{"$f":"'11-państw.fund.cel.'!F60","v":0},{"$f":"'11-państw.fund.cel.'!G60","v":0},{"$f":"'11-państw.fund.cel.'!D61","v":0},{"$f":"'11-państw.fund.cel.'!E61","v":0},{"$f":"'11-państw.fund.cel.'!F61","v":0},{"$f":"'11-państw.fund.cel.'!G61","v":0},{"$f":"'11-państw.fund.cel.'!D62","v":0},{"$f":"'11-państw.fund.cel.'!E62","v":0},{"$f":"'11-państw.fund.cel.'!F62","v":0},{"$f":"'11-państw.fund.cel.'!G62","v":0},{"$f":"'11-państw.fund.cel.'!D63","v":0},{"$f":"'11-państw.fund.cel.'!E63","v":0},{"$f":"'11-państw.fund.cel.'!F63","v":0},{"$f":"'11-państw.fund.cel.'!G63","v":0},{"$f":"'11-państw.fund.cel.'!D64","v":0},{"$f":"'11-państw.fund.cel.'!E64","v":0},{"$f":"'11-państw.fund.cel.'!F64","v":0},{"$f":"'11-państw.fund.cel.'!G64","v":0},{"$f":"'11-państw.fund.cel.'!D65","v":0},{"$f":"'11-państw.fund.cel.'!E65","v":0},{"$f":"'11-państw.fund.cel.'!F65","v":0},{"$f":"'11-państw.fund.cel.'!G65","v":0}]
[{"$f":"'20-państw.szk.wyż.'!A8","v":0},null,null,null,null,{"$f":"'20-państw.szk.wyż.'!L11","v":20},{"$f":"'20-państw.szk.wyż.'!K8","v":0},{"$f":"'20-państw.szk.wyż.'!H8","v":4},{"$f":"'20-państw.szk.wyż.'!M11","v":0},null,null,{"$f":"'20-państw.szk.wyż.'!D53","v":0},{"$f":"'20-państw.szk.wyż.'!E53","v":0},{"$f":"'20-państw.szk.wyż.'!F53","v":0},{"$f":"'20-państw.szk.wyż.'!G53","v":0},{"$f":"'20-państw.szk.wyż.'!D54","v":0},{"$f":"'20-państw.szk.wyż.'!E54","v":0},{"$f":"'20-państw.szk.wyż.'!F54","v":0},{"$f":"'20-państw.szk.wyż.'!G54","v":0},{"$f":"'20-państw.szk.wyż.'!D55","v":0},{"$f":"'20-państw.szk.wyż.'!E55","v":0},{"$f":"'20-państw.szk.wyż.'!F55","v":0},{"$f":"'20-państw.szk.wyż.'!G55","v":0},{"$f":"'20-państw.szk.wyż.'!D56","v":0},{"$f":"'20-państw.szk.wyż.'!E56","v":0},{"$f":"'20-państw.szk.wyż.'!F56","v":0},{"$f":"'20-państw.szk.wyż.'!G56","v":0},{"$f":"'20-państw.szk.wyż.'!D57","v":0},{"$f":"'20-państw.szk.wyż.'!E57","v":0},{"$f":"'20-państw.szk.wyż.'!F57","v":0},{"$f":"'20-państw.szk.wyż.'!G57","v":0},{"$f":"'20-państw.szk.wyż.'!D58","v":0},{"$f":"'20-państw.szk.wyż.'!E58","v":0},{"$f":"'20-państw.szk.wyż.'!F58","v":0},{"$f":"'20-państw.szk.wyż.'!G58","v":0},{"$f":"'20-państw.szk.wyż.'!D59","v":0},{"$f":"'20-państw.szk.wyż.'!E59","v":0},{"$f":"'20-państw.szk.wyż.'!F59","v":0},{"$f":"'20-państw.szk.wyż.'!G59","v":0},{"$f":"'20-państw.szk.wyż.'!D60","v":0},{"$f":"'20-państw.szk.wyż.'!E60","v":0},{"$f":"'20-państw.szk.wyż.'!F60","v":0},{"$f":"'20-państw.szk.wyż.'!G60","v":0},{"$f":"'20-państw.szk.wyż.'!D61","v":0},{"$f":"'20-państw.szk.wyż.'!E61","v":0},{"$f":"'20-państw.szk.wyż.'!F61","v":0},{"$f":"'20-państw.szk.wyż.'!G61","v":0},{"$f":"'20-państw.szk.wyż.'!D62","v":0},{"$f":"'20-państw.szk.wyż.'!E62","v":0},{"$f":"'20-państw.szk.wyż.'!F62","v":0},{"$f":"'20-państw.szk.wyż.'!G62","v":0},{"$f":"'20-państw.szk.wyż.'!D63","v":0},{"$f":"'20-państw.szk.wyż.'!E63","v":0},{"$f":"'20-państw.szk.wyż.'!F63","v":0},{"$f":"'20-państw.szk.wyż.'!G63","v":0},{"$f":"'20-państw.szk.wyż.'!D64","v":0},{"$f":"'20-państw.szk.wyż.'!E64","v":0},{"$f":"'20-państw.szk.wyż.'!F64","v":0},{"$f":"'20-państw.szk.wyż.'!G64","v":0},{"$f":"'20-państw.szk.wyż.'!D65","v":0},{"$f":"'20-państw.szk.wyż.'!E65","v":0},{"$f":"'20-państw.szk.wyż.'!F65","v":0},{"$f":"'20-państw.szk.wyż.'!G65","v":0}]
[{"$f":"'31-instytucje gosp budż'!A8","v":0},null,null,null,null,{"$f":"'31-instytucje gosp budż'!L11","v":31},{"$f":"'31-instytucje gosp budż'!K8","v":0},{"$f":"'31-instytucje gosp budż'!H8","v":4},{"$f":"'31-instytucje gosp budż'!M11","v":0},null,null,{"$f":"'31-instytucje gosp budż'!D53","v":0},{"$f":"'31-instytucje gosp budż'!E53","v":0},{"$f":"'31-instytucje gosp budż'!F53","v":0},{"$f":"'31-instytucje gosp budż'!G53","v":0},{"$f":"'31-instytucje gosp budż'!D54","v":0},{"$f":"'31-instytucje gosp budż'!E54","v":0},{"$f":"'31-instytucje gosp budż'!F54","v":0},{"$f":"'31-instytucje gosp budż'!G54","v":0},{"$f":"'31-instytucje gosp budż'!D55","v":0},{"$f":"'31-instytucje gosp budż'!E55","v":0},{"$f":"'31-instytucje gosp budż'!F55","v":0},{"$f":"'31-instytucje gosp budż'!G55","v":0},{"$f":"'31-instytucje gosp budż'!D56","v":0},{"$f":"'31-instytucje gosp budż'!E56","v":0},{"$f":"'31-instytucje gosp budż'!F56","v":0},{"$f":"'31-instytucje gosp budż'!G56","v":0},{"$f":"'31-instytucje gosp budż'!D57","v":0},{"$f":"'31-instytucje gosp budż'!E57","v":0},{"$f":"'31-instytucje gosp budż'!F57","v":0},{"$f":"'31-instytucje gosp budż'!G57","v":0},{"$f":"'31-instytucje gosp budż'!D58","v":0},{"$f":"'31-instytucje gosp budż'!E58","v":0},{"$f":"'31-instytucje gosp budż'!F58","v":0},{"$f":"'31-instytucje gosp budż'!G58","v":0},{"$f":"'31-instytucje gosp budż'!D59","v":0},{"$f":"'31-instytucje gosp budż'!E59","v":0},{"$f":"'31-instytucje gosp budż'!F59","v":0},{"$f":"'31-instytucje gosp budż'!G59","v":0},{"$f":"'31-instytucje gosp budż'!D60","v":0},{"$f":"'31-instytucje gosp budż'!E60","v":0},{"$f":"'31-instytucje gosp budż'!F60","v":0},{"$f":"'31-instytucje gosp budż'!G60","v":0},{"$f":"'31-instytucje gosp budż'!D61","v":0},{"$f":"'31-instytucje gosp budż'!E61","v":0},{"$f":"'31-instytucje gosp budż'!F61","v":0},{"$f":"'31-instytucje gosp budż'!G61","v":0},{"$f":"'31-instytucje gosp budż'!D62","v":0},{"$f":"'31-instytucje gosp budż'!E62","v":0},{"$f":"'31-instytucje gosp budż'!F62","v":0},{"$f":"'31-instytucje gosp budż'!G62","v":0},{"$f":"'31-instytucje gosp budż'!D63","v":0},{"$f":"'31-instytucje gosp budż'!E63","v":0},{"$f":"'31-instytucje gosp budż'!F63","v":0},{"$f":"'31-instytucje gosp budż'!G63","v":0},{"$f":"'31-instytucje gosp budż'!D64","v":0},{"$f":"'31-instytucje gosp budż'!E64","v":0},{"$f":"'31-instytucje gosp budż'!F64","v":0},{"$f":"'31-instytucje gosp budż'!G64","v":0},{"$f":"'31-instytucje gosp budż'!D65","v":0},{"$f":"'31-instytucje gosp budż'!E65","v":0},{"$f":"'31-instytucje gosp budż'!F65","v":0},{"$f":"'31-instytucje gosp budż'!G65","v":0}]
[{"$f":"'41-państw.inst.kult.'!A8","v":0},null,null,null,null,{"$f":"'41-państw.inst.kult.'!L11","v":41},{"$f":"'41-państw.inst.kult.'!K8","v":0},{"$f":"'41-państw.inst.kult.'!H8","v":4},{"$f":"'41-państw.inst.kult.'!M11","v":0},null,null,{"$f":"'41-państw.inst.kult.'!D53","v":0},{"$f":"'41-państw.inst.kult.'!E53","v":0},{"$f":"'41-państw.inst.kult.'!F53","v":0},{"$f":"'41-państw.inst.kult.'!G53","v":0},{"$f":"'41-państw.inst.kult.'!D54","v":0},{"$f":"'41-państw.inst.kult.'!E54","v":0},{"$f":"'41-państw.inst.kult.'!F54","v":0},{"$f":"'41-państw.inst.kult.'!G54","v":0},{"$f":"'41-państw.inst.kult.'!D55","v":0},{"$f":"'41-państw.inst.kult.'!E55","v":0},{"$f":"'41-państw.inst.kult.'!F55","v":0},{"$f":"'41-państw.inst.kult.'!G55","v":0},{"$f":"'41-państw.inst.kult.'!D56","v":0},{"$f":"'41-państw.inst.kult.'!E56","v":0},{"$f":"'41-państw.inst.kult.'!F56","v":0},{"$f":"'41-państw.inst.kult.'!G56","v":0},{"$f":"'41-państw.inst.kult.'!D57","v":0},{"$f":"'41-państw.inst.kult.'!E57","v":0},{"$f":"'41-państw.inst.kult.'!F57","v":0},{"$f":"'41-państw.inst.kult.'!G57","v":0},{"$f":"'41-państw.inst.kult.'!D58","v":0},{"$f":"'41-państw.inst.kult.'!E58","v":0},{"$f":"'41-państw.inst.kult.'!F58","v":0},{"$f":"'41-państw.inst.kult.'!G58","v":0},{"$f":"'41-państw.inst.kult.'!D59","v":0},{"$f":"'41-państw.inst.kult.'!E59","v":0},{"$f":"'41-państw.inst.kult.'!F59","v":0},{"$f":"'41-państw.inst.kult.'!G59","v":0},{"$f":"'41-państw.inst.kult.'!D60","v":0},{"$f":"'41-państw.inst.kult.'!E60","v":0},{"$f":"'41-państw.inst.kult.'!F60","v":0},{"$f":"'41-państw.inst.kult.'!G60","v":0},{"$f":"'41-państw.inst.kult.'!D61","v":0},{"$f":"'41-państw.inst.kult.'!E61","v":0},{"$f":"'41-państw.inst.kult.'!F61","v":0},{"$f":"'41-państw.inst.kult.'!G61","v":0},{"$f":"'41-państw.inst.kult.'!D62","v":0},{"$f":"'41-państw.inst.kult.'!E62","v":0},{"$f":"'41-państw.inst.kult.'!F62","v":0},{"$f":"'41-państw.inst.kult.'!G62","v":0},{"$f":"'41-państw.inst.kult.'!D63","v":0},{"$f":"'41-państw.inst.kult.'!E63","v":0},{"$f":"'41-państw.inst.kult.'!F63","v":0},{"$f":"'41-państw.inst.kult.'!G63","v":0},{"$f":"'41-państw.inst.kult.'!D64","v":0},{"$f":"'41-państw.inst.kult.'!E64","v":0},{"$f":"'41-państw.inst.kult.'!F64","v":0},{"$f":"'41-państw.inst.kult.'!G64","v":0},{"$f":"'41-państw.inst.kult.'!D65","v":0},{"$f":"'41-państw.inst.kult.'!E65","v":0},{"$f":"'41-państw.inst.kult.'!F65","v":0},{"$f":"'41-państw.inst.kult.'!G65","v":0}]
[{"$f":"'42-samorz.inst.kult.'!A8","v":0},null,null,null,null,{"$f":"'42-samorz.inst.kult.'!L11","v":42},{"$f":"'42-samorz.inst.kult.'!K8","v":0},{"$f":"'42-samorz.inst.kult.'!H8","v":4},{"$f":"'42-samorz.inst.kult.'!M11","v":0},null,null,{"$f":"'42-samorz.inst.kult.'!D53","v":0},{"$f":"'42-samorz.inst.kult.'!E53","v":0},{"$f":"'42-samorz.inst.kult.'!F53","v":0},{"$f":"'42-samorz.inst.kult.'!G53","v":0},{"$f":"'42-samorz.inst.kult.'!D54","v":0},{"$f":"'42-samorz.inst.kult.'!E54","v":0},{"$f":"'42-samorz.inst.kult.'!F54","v":0},{"$f":"'42-samorz.inst.kult.'!G54","v":0},{"$f":"'42-samorz.inst.kult.'!D55","v":0},{"$f":"'42-samorz.inst.kult.'!E55","v":0},{"$f":"'42-samorz.inst.kult.'!F55","v":0},{"$f":"'42-samorz.inst.kult.'!G55","v":0},{"$f":"'42-samorz.inst.kult.'!D56","v":0},{"$f":"'42-samorz.inst.kult.'!E56","v":0},{"$f":"'42-samorz.inst.kult.'!F56","v":0},{"$f":"'42-samorz.inst.kult.'!G56","v":0},{"$f":"'42-samorz.inst.kult.'!D57","v":0},{"$f":"'42-samorz.inst.kult.'!E57","v":0},{"$f":"'42-samorz.inst.kult.'!F57","v":0},{"$f":"'42-samorz.inst.kult.'!G57","v":0},{"$f":"'42-samorz.inst.kult.'!D58","v":0},{"$f":"'42-samorz.inst.kult.'!E58","v":0},{"$f":"'42-samorz.inst.kult.'!F58","v":0},{"$f":"'42-samorz.inst.kult.'!G58","v":0},{"$f":"'42-samorz.inst.kult.'!D59","v":0},{"$f":"'42-samorz.inst.kult.'!E59","v":0},{"$f":"'42-samorz.inst.kult.'!F59","v":0},{"$f":"'42-samorz.inst.kult.'!G59","v":0},{"$f":"'42-samorz.inst.kult.'!D60","v":0},{"$f":"'42-samorz.inst.kult.'!E60","v":0},{"$f":"'42-samorz.inst.kult.'!F60","v":0},{"$f":"'42-samorz.inst.kult.'!G60","v":0},{"$f":"'42-samorz.inst.kult.'!D61","v":0},{"$f":"'42-samorz.inst.kult.'!E61","v":0},{"$f":"'42-samorz.inst.kult.'!F61","v":0},{"$f":"'42-samorz.inst.kult.'!G61","v":0},{"$f":"'42-samorz.inst.kult.'!D62","v":0},{"$f":"'42-samorz.inst.kult.'!E62","v":0},{"$f":"'42-samorz.inst.kult.'!F62","v":0},{"$f":"'42-samorz.inst.kult.'!G62","v":0},{"$f":"'42-samorz.inst.kult.'!D63","v":0},{"$f":"'42-samorz.inst.kult.'!E63","v":0},{"$f":"'42-samorz.inst.kult.'!F63","v":0},{"$f":"'42-samorz.inst.kult.'!G63","v":0},{"$f":"'42-samorz.inst.kult.'!D64","v":0},{"$f":"'42-samorz.inst.kult.'!E64","v":0},{"$f":"'42-samorz.inst.kult.'!F64","v":0},{"$f":"'42-samorz.inst.kult.'!G64","v":0},{"$f":"'42-samorz.inst.kult.'!D65","v":0},{"$f":"'42-samorz.inst.kult.'!E65","v":0},{"$f":"'42-samorz.inst.kult.'!F65","v":0},{"$f":"'42-samorz.inst.kult.'!G65","v":0}]
[{"$f":"'50-PAN i jedn.tworz.przez PAN'!A8","v":0},null,null,null,null,{"$f":"'50-PAN i jedn.tworz.przez PAN'!L11","v":50},{"$f":"'50-PAN i jedn.tworz.przez PAN'!K8","v":0},{"$f":"'50-PAN i jedn.tworz.przez PAN'!H8","v":4},{"$f":"'50-PAN i jedn.tworz.przez PAN'!M11","v":0},null,null,{"$f":"'50-PAN i jedn.tworz.przez PAN'!D53","v":0},{"$f":"'50-PAN i jedn.tworz.przez PAN'!E53","v":0},{"$f":"'50-PAN i jedn.tworz.przez PAN'!F53","v":0},{"$f":"'50-PAN i jedn.tworz.przez PAN'!G53","v":0},{"$f":"'50-PAN i jedn.tworz.przez PAN'!D54","v":0},{"$f":"'50-PAN i jedn.tworz.przez PAN'!E54","v":0},{"$f":"'50-PAN i jedn.tworz.przez PAN'!F54","v":0},{"$f":"'50-PAN i jedn.tworz.przez PAN'!G54","v":0},{"$f":"'50-PAN i jedn.tworz.przez PAN'!D55","v":0},{"$f":"'50-PAN i jedn.tworz.przez PAN'!E55","v":0},{"$f":"'50-PAN i jedn.tworz.przez PAN'!F55","v":0},{"$f":"'50-PAN i jedn.tworz.przez PAN'!G55","v":0},{"$f":"'50-PAN i jedn.tworz.przez PAN'!D56","v":0},{"$f":"'50-PAN i jedn.tworz.przez PAN'!E56","v":0},{"$f":"'50-PAN i jedn.tworz.przez PAN'!F56","v":0},{"$f":"'50-PAN i jedn.tworz.przez PAN'!G56","v":0},{"$f":"'50-PAN i jedn.tworz.przez PAN'!D57","v":0},{"$f":"'50-PAN i jedn.tworz.przez PAN'!E57","v":0},{"$f":"'50-PAN i jedn.tworz.przez PAN'!F57","v":0},{"$f":"'50-PAN i jedn.tworz.przez PAN'!G57","v":0},{"$f":"'50-PAN i jedn.tworz.przez PAN'!D58","v":0},{"$f":"'50-PAN i jedn.tworz.przez PAN'!E58","v":0},{"$f":"'50-PAN i jedn.tworz.przez PAN'!F58","v":0},{"$f":"'50-PAN i jedn.tworz.przez PAN'!G58","v":0},{"$f":"'50-PAN i jedn.tworz.przez PAN'!D59","v":0},{"$f":"'50-PAN i jedn.tworz.przez PAN'!E59","v":0},{"$f":"'50-PAN i jedn.tworz.przez PAN'!F59","v":0},{"$f":"'50-PAN i jedn.tworz.przez PAN'!G59","v":0},{"$f":"'50-PAN i jedn.tworz.przez PAN'!D60","v":0},{"$f":"'50-PAN i jedn.tworz.przez PAN'!E60","v":0},{"$f":"'50-PAN i jedn.tworz.przez PAN'!F60","v":0},{"$f":"'50-PAN i jedn.tworz.przez PAN'!G60","v":0},{"$f":"'50-PAN i jedn.tworz.przez PAN'!D61","v":0},{"$f":"'50-PAN i jedn.tworz.przez PAN'!E61","v":0},{"$f":"'50-PAN i jedn.tworz.przez PAN'!F61","v":0},{"$f":"'50-PAN i jedn.tworz.przez PAN'!G61","v":0},{"$f":"'50-PAN i jedn.tworz.przez PAN'!D62","v":0},{"$f":"'50-PAN i jedn.tworz.przez PAN'!E62","v":0},{"$f":"'50-PAN i jedn.tworz.przez PAN'!F62","v":0},{"$f":"'50-PAN i jedn.tworz.przez PAN'!G62","v":0},{"$f":"'50-PAN i jedn.tworz.przez PAN'!D63","v":0},{"$f":"'50-PAN i jedn.tworz.przez PAN'!E63","v":0},{"$f":"'50-PAN i jedn.tworz.przez PAN'!F63","v":0},{"$f":"'50-PAN i jedn.tworz.przez PAN'!G63","v":0},{"$f":"'50-PAN i jedn.tworz.przez PAN'!D64","v":0},{"$f":"'50-PAN i jedn.tworz.przez PAN'!E64","v":0},{"$f":"'50-PAN i jedn.tworz.przez PAN'!F64","v":0},{"$f":"'50-PAN i jedn.tworz.przez PAN'!G64","v":0},{"$f":"'50-PAN i jedn.tworz.przez PAN'!D65","v":0},{"$f":"'50-PAN i jedn.tworz.przez PAN'!E65","v":0},{"$f":"'50-PAN i jedn.tworz.przez PAN'!F65","v":0},{"$f":"'50-PAN i jedn.tworz.przez PAN'!G65","v":0}]
[{"$f":"'61-samodz.publ.ZOZ państw.'!A8","v":0},null,null,null,null,{"$f":"'61-samodz.publ.ZOZ państw.'!L11","v":61},{"$f":"'61-samodz.publ.ZOZ państw.'!K8","v":0},{"$f":"'61-samodz.publ.ZOZ państw.'!H8","v":4},{"$f":"'61-samodz.publ.ZOZ państw.'!M11","v":0},null,null,{"$f":"'61-samodz.publ.ZOZ państw.'!D53","v":0},{"$f":"'61-samodz.publ.ZOZ państw.'!E53","v":0},{"$f":"'61-samodz.publ.ZOZ państw.'!F53","v":0},{"$f":"'61-samodz.publ.ZOZ państw.'!G53","v":0},{"$f":"'61-samodz.publ.ZOZ państw.'!D54","v":0},{"$f":"'61-samodz.publ.ZOZ państw.'!E54","v":0},{"$f":"'61-samodz.publ.ZOZ państw.'!F54","v":0},{"$f":"'61-samodz.publ.ZOZ państw.'!G54","v":0},{"$f":"'61-samodz.publ.ZOZ państw.'!D55","v":0},{"$f":"'61-samodz.publ.ZOZ państw.'!E55","v":0},{"$f":"'61-samodz.publ.ZOZ państw.'!F55","v":0},{"$f":"'61-samodz.publ.ZOZ państw.'!G55","v":0},{"$f":"'61-samodz.publ.ZOZ państw.'!D56","v":0},{"$f":"'61-samodz.publ.ZOZ państw.'!E56","v":0},{"$f":"'61-samodz.publ.ZOZ państw.'!F56","v":0},{"$f":"'61-samodz.publ.ZOZ państw.'!G56","v":0},{"$f":"'61-samodz.publ.ZOZ państw.'!D57","v":0},{"$f":"'61-samodz.publ.ZOZ państw.'!E57","v":0},{"$f":"'61-samodz.publ.ZOZ państw.'!F57","v":0},{"$f":"'61-samodz.publ.ZOZ państw.'!G57","v":0},{"$f":"'61-samodz.publ.ZOZ państw.'!D58","v":0},{"$f":"'61-samodz.publ.ZOZ państw.'!E58","v":0},{"$f":"'61-samodz.publ.ZOZ państw.'!F58","v":0},{"$f":"'61-samodz.publ.ZOZ państw.'!G58","v":0},{"$f":"'61-samodz.publ.ZOZ państw.'!D59","v":0},{"$f":"'61-samodz.publ.ZOZ państw.'!E59","v":0},{"$f":"'61-samodz.publ.ZOZ państw.'!F59","v":0},{"$f":"'61-samodz.publ.ZOZ państw.'!G59","v":0},{"$f":"'61-samodz.publ.ZOZ państw.'!D60","v":0},{"$f":"'61-samodz.publ.ZOZ państw.'!E60","v":0},{"$f":"'61-samodz.publ.ZOZ państw.'!F60","v":0},{"$f":"'61-samodz.publ.ZOZ państw.'!G60","v":0},{"$f":"'61-samodz.publ.ZOZ państw.'!D61","v":0},{"$f":"'61-samodz.publ.ZOZ państw.'!E61","v":0},{"$f":"'61-samodz.publ.ZOZ państw.'!F61","v":0},{"$f":"'61-samodz.publ.ZOZ państw.'!G61","v":0},{"$f":"'61-samodz.publ.ZOZ państw.'!D62","v":0},{"$f":"'61-samodz.publ.ZOZ państw.'!E62","v":0},{"$f":"'61-samodz.publ.ZOZ państw.'!F62","v":0},{"$f":"'61-samodz.publ.ZOZ państw.'!G62","v":0},{"$f":"'61-samodz.publ.ZOZ państw.'!D63","v":0},{"$f":"'61-samodz.publ.ZOZ państw.'!E63","v":0},{"$f":"'61-samodz.publ.ZOZ państw.'!F63","v":0},{"$f":"'61-samodz.publ.ZOZ państw.'!G63","v":0},{"$f":"'61-samodz.publ.ZOZ państw.'!D64","v":0},{"$f":"'61-samodz.publ.ZOZ państw.'!E64","v":0},{"$f":"'61-samodz.publ.ZOZ państw.'!F64","v":0},{"$f":"'61-samodz.publ.ZOZ państw.'!G64","v":0},{"$f":"'61-samodz.publ.ZOZ państw.'!D65","v":0},{"$f":"'61-samodz.publ.ZOZ państw.'!E65","v":0},{"$f":"'61-samodz.publ.ZOZ państw.'!F65","v":0},{"$f":"'61-samodz.publ.ZOZ państw.'!G65","v":0}]
[{"$f":"'62-samodz.publ.ZOZ samorz.'!A8","v":0},null,null,null,null,{"$f":"'62-samodz.publ.ZOZ samorz.'!L11","v":62},{"$f":"'62-samodz.publ.ZOZ samorz.'!K8","v":0},{"$f":"'62-samodz.publ.ZOZ samorz.'!H8","v":4},{"$f":"'62-samodz.publ.ZOZ samorz.'!M11","v":0},null,null,{"$f":"'62-samodz.publ.ZOZ samorz.'!D53","v":0},{"$f":"'62-samodz.publ.ZOZ samorz.'!E53","v":0},{"$f":"'62-samodz.publ.ZOZ samorz.'!F53","v":0},{"$f":"'62-samodz.publ.ZOZ samorz.'!G53","v":0},{"$f":"'62-samodz.publ.ZOZ samorz.'!D54","v":0},{"$f":"'62-samodz.publ.ZOZ samorz.'!E54","v":0},{"$f":"'62-samodz.publ.ZOZ samorz.'!F54","v":0},{"$f":"'62-samodz.publ.ZOZ samorz.'!G54","v":0},{"$f":"'62-samodz.publ.ZOZ samorz.'!D55","v":0},{"$f":"'62-samodz.publ.ZOZ samorz.'!E55","v":0},{"$f":"'62-samodz.publ.ZOZ samorz.'!F55","v":0},{"$f":"'62-samodz.publ.ZOZ samorz.'!G55","v":0},{"$f":"'62-samodz.publ.ZOZ samorz.'!D56","v":0},{"$f":"'62-samodz.publ.ZOZ samorz.'!E56","v":0},{"$f":"'62-samodz.publ.ZOZ samorz.'!F56","v":0},{"$f":"'62-samodz.publ.ZOZ samorz.'!G56","v":0},{"$f":"'62-samodz.publ.ZOZ samorz.'!D57","v":0},{"$f":"'62-samodz.publ.ZOZ samorz.'!E57","v":0},{"$f":"'62-samodz.publ.ZOZ samorz.'!F57","v":0},{"$f":"'62-samodz.publ.ZOZ samorz.'!G57","v":0},{"$f":"'62-samodz.publ.ZOZ samorz.'!D58","v":0},{"$f":"'62-samodz.publ.ZOZ samorz.'!E58","v":0},{"$f":"'62-samodz.publ.ZOZ samorz.'!F58","v":0},{"$f":"'62-samodz.publ.ZOZ samorz.'!G58","v":0},{"$f":"'62-samodz.publ.ZOZ samorz.'!D59","v":0},{"$f":"'62-samodz.publ.ZOZ samorz.'!E59","v":0},{"$f":"'62-samodz.publ.ZOZ samorz.'!F59","v":0},{"$f":"'62-samodz.publ.ZOZ samorz.'!G59","v":0},{"$f":"'62-samodz.publ.ZOZ samorz.'!D60","v":0},{"$f":"'62-samodz.publ.ZOZ samorz.'!E60","v":0},{"$f":"'62-samodz.publ.ZOZ samorz.'!F60","v":0},{"$f":"'62-samodz.publ.ZOZ samorz.'!G60","v":0},{"$f":"'62-samodz.publ.ZOZ samorz.'!D61","v":0},{"$f":"'62-samodz.publ.ZOZ samorz.'!E61","v":0},{"$f":"'62-samodz.publ.ZOZ samorz.'!F61","v":0},{"$f":"'62-samodz.publ.ZOZ samorz.'!G61","v":0},{"$f":"'62-samodz.publ.ZOZ samorz.'!D62","v":0},{"$f":"'62-samodz.publ.ZOZ samorz.'!E62","v":0},{"$f":"'62-samodz.publ.ZOZ samorz.'!F62","v":0},{"$f":"'62-samodz.publ.ZOZ samorz.'!G62","v":0},{"$f":"'62-samodz.publ.ZOZ samorz.'!D63","v":0},{"$f":"'62-samodz.publ.ZOZ samorz.'!E63","v":0},{"$f":"'62-samodz.publ.ZOZ samorz.'!F63","v":0},{"$f":"'62-samodz.publ.ZOZ samorz.'!G63","v":0},{"$f":"'62-samodz.publ.ZOZ samorz.'!D64","v":0},{"$f":"'62-samodz.publ.ZOZ samorz.'!E64","v":0},{"$f":"'62-samodz.publ.ZOZ samorz.'!F64","v":0},{"$f":"'62-samodz.publ.ZOZ samorz.'!G64","v":0},{"$f":"'62-samodz.publ.ZOZ samorz.'!D65","v":0},{"$f":"'62-samodz.publ.ZOZ samorz.'!E65","v":0},{"$f":"'62-samodz.publ.ZOZ samorz.'!F65","v":0},{"$f":"'62-samodz.publ.ZOZ samorz.'!G65","v":0}]
[{"$f":"'63-Narodowy Fundusz Zdrowia'!A8","v":0},null,null,null,null,{"$f":"'63-Narodowy Fundusz Zdrowia'!L11","v":63},{"$f":"'63-Narodowy Fundusz Zdrowia'!K8","v":0},{"$f":"'63-Narodowy Fundusz Zdrowia'!H8","v":4},{"$f":"'63-Narodowy Fundusz Zdrowia'!M11","v":0},null,null,{"$f":"'63-Narodowy Fundusz Zdrowia'!D53","v":0},{"$f":"'63-Narodowy Fundusz Zdrowia'!E53","v":0},{"$f":"'63-Narodowy Fundusz Zdrowia'!F53","v":0},{"$f":"'63-Narodowy Fundusz Zdrowia'!G53","v":0},{"$f":"'63-Narodowy Fundusz Zdrowia'!D54","v":0},{"$f":"'63-Narodowy Fundusz Zdrowia'!E54","v":0},{"$f":"'63-Narodowy Fundusz Zdrowia'!F54","v":0},{"$f":"'63-Narodowy Fundusz Zdrowia'!G54","v":0},{"$f":"'63-Narodowy Fundusz Zdrowia'!D55","v":0},{"$f":"'63-Narodowy Fundusz Zdrowia'!E55","v":0},{"$f":"'63-Narodowy Fundusz Zdrowia'!F55","v":0},{"$f":"'63-Narodowy Fundusz Zdrowia'!G55","v":0},{"$f":"'63-Narodowy Fundusz Zdrowia'!D56","v":0},{"$f":"'63-Narodowy Fundusz Zdrowia'!E56","v":0},{"$f":"'63-Narodowy Fundusz Zdrowia'!F56","v":0},{"$f":"'63-Narodowy Fundusz Zdrowia'!G56","v":0},{"$f":"'63-Narodowy Fundusz Zdrowia'!D57","v":0},{"$f":"'63-Narodowy Fundusz Zdrowia'!E57","v":0},{"$f":"'63-Narodowy Fundusz Zdrowia'!F57","v":0},{"$f":"'63-Narodowy Fundusz Zdrowia'!G57","v":0},{"$f":"'63-Narodowy Fundusz Zdrowia'!D58","v":0},{"$f":"'63-Narodowy Fundusz Zdrowia'!E58","v":0},{"$f":"'63-Narodowy Fundusz Zdrowia'!F58","v":0},{"$f":"'63-Narodowy Fundusz Zdrowia'!G58","v":0},{"$f":"'63-Narodowy Fundusz Zdrowia'!D59","v":0},{"$f":"'63-Narodowy Fundusz Zdrowia'!E59","v":0},{"$f":"'63-Narodowy Fundusz Zdrowia'!F59","v":0},{"$f":"'63-Narodowy Fundusz Zdrowia'!G59","v":0},{"$f":"'63-Narodowy Fundusz Zdrowia'!D60","v":0},{"$f":"'63-Narodowy Fundusz Zdrowia'!E60","v":0},{"$f":"'63-Narodowy Fundusz Zdrowia'!F60","v":0},{"$f":"'63-Narodowy Fundusz Zdrowia'!G60","v":0},{"$f":"'63-Narodowy Fundusz Zdrowia'!D61","v":0},{"$f":"'63-Narodowy Fundusz Zdrowia'!E61","v":0},{"$f":"'63-Narodowy Fundusz Zdrowia'!F61","v":0},{"$f":"'63-Narodowy Fundusz Zdrowia'!G61","v":0},{"$f":"'63-Narodowy Fundusz Zdrowia'!D62","v":0},{"$f":"'63-Narodowy Fundusz Zdrowia'!E62","v":0},{"$f":"'63-Narodowy Fundusz Zdrowia'!F62","v":0},{"$f":"'63-Narodowy Fundusz Zdrowia'!G62","v":0},{"$f":"'63-Narodowy Fundusz Zdrowia'!D63","v":0},{"$f":"'63-Narodowy Fundusz Zdrowia'!E63","v":0},{"$f":"'63-Narodowy Fundusz Zdrowia'!F63","v":0},{"$f":"'63-Narodowy Fundusz Zdrowia'!G63","v":0},{"$f":"'63-Narodowy Fundusz Zdrowia'!D64","v":0},{"$f":"'63-Narodowy Fundusz Zdrowia'!E64","v":0},{"$f":"'63-Narodowy Fundusz Zdrowia'!F64","v":0},{"$f":"'63-Narodowy Fundusz Zdrowia'!G64","v":0},{"$f":"'63-Narodowy Fundusz Zdrowia'!D65","v":0},{"$f":"'63-Narodowy Fundusz Zdrowia'!E65","v":0},{"$f":"'63-Narodowy Fundusz Zdrowia'!F65","v":0},{"$f":"'63-Narodowy Fundusz Zdrowia'!G65","v":0}]
[{"$f":"'71-ZUS'!A8","v":0},null,null,null,null,{"$f":"'71-ZUS'!L11","v":71},{"$f":"'71-ZUS'!K8","v":0},{"$f":"'71-ZUS'!H8","v":4},{"$f":"'71-ZUS'!M11","v":0},null,null,{"$f":"'71-ZUS'!D53","v":0},{"$f":"'71-ZUS'!E53","v":0},{"$f":"'71-ZUS'!F53","v":0},{"$f":"'71-ZUS'!G53","v":0},{"$f":"'71-ZUS'!D54","v":0},{"$f":"'71-ZUS'!E54","v":0},{"$f":"'71-ZUS'!F54","v":0},{"$f":"'71-ZUS'!G54","v":0},{"$f":"'71-ZUS'!D55","v":0},{"$f":"'71-ZUS'!E55","v":0},{"$f":"'71-ZUS'!F55","v":0},{"$f":"'71-ZUS'!G55","v":0},{"$f":"'71-ZUS'!D56","v":0},{"$f":"'71-ZUS'!E56","v":0},{"$f":"'71-ZUS'!F56","v":0},{"$f":"'71-ZUS'!G56","v":0},{"$f":"'71-ZUS'!D57","v":0},{"$f":"'71-ZUS'!E57","v":0},{"$f":"'71-ZUS'!F57","v":0},{"$f":"'71-ZUS'!G57","v":0},{"$f":"'71-ZUS'!D58","v":0},{"$f":"'71-ZUS'!E58","v":0},{"$f":"'71-ZUS'!F58","v":0},{"$f":"'71-ZUS'!G58","v":0},{"$f":"'71-ZUS'!D59","v":0},{"$f":"'71-ZUS'!E59","v":0},{"$f":"'71-ZUS'!F59","v":0},{"$f":"'71-ZUS'!G59","v":0},{"$f":"'71-ZUS'!D60","v":0},{"$f":"'71-ZUS'!E60","v":0},{"$f":"'71-ZUS'!F60","v":0},{"$f":"'71-ZUS'!G60","v":0},{"$f":"'71-ZUS'!D61","v":0},{"$f":"'71-ZUS'!E61","v":0},{"$f":"'71-ZUS'!F61","v":0},{"$f":"'71-ZUS'!G61","v":0},{"$f":"'71-ZUS'!D62","v":0},{"$f":"'71-ZUS'!E62","v":0},{"$f":"'71-ZUS'!F62","v":0},{"$f":"'71-ZUS'!G62","v":0},{"$f":"'71-ZUS'!D63","v":0},{"$f":"'71-ZUS'!E63","v":0},{"$f":"'71-ZUS'!F63","v":0},{"$f":"'71-ZUS'!G63","v":0},{"$f":"'71-ZUS'!D64","v":0},{"$f":"'71-ZUS'!E64","v":0},{"$f":"'71-ZUS'!F64","v":0},{"$f":"'71-ZUS'!G64","v":0},{"$f":"'71-ZUS'!D65","v":0},{"$f":"'71-ZUS'!E65","v":0},{"$f":"'71-ZUS'!F65","v":0},{"$f":"'71-ZUS'!G65","v":0}]
[{"$f":"'72-fund.zarz.przez ZUS'!A8:B8","v":0},null,null,null,null,{"$f":"'72-fund.zarz.przez ZUS'!L11","v":72},{"$f":"'72-fund.zarz.przez ZUS'!K8","v":0},{"$f":"'72-fund.zarz.przez ZUS'!H8","v":4},{"$f":"'72-fund.zarz.przez ZUS'!M11","v":0},null,null,{"$f":"'72-fund.zarz.przez ZUS'!D53","v":0},{"$f":"'72-fund.zarz.przez ZUS'!E53","v":0},{"$f":"'72-fund.zarz.przez ZUS'!F53","v":0},{"$f":"'72-fund.zarz.przez ZUS'!G53","v":0},{"$f":"'72-fund.zarz.przez ZUS'!D54","v":0},{"$f":"'72-fund.zarz.przez ZUS'!E54","v":0},{"$f":"'72-fund.zarz.przez ZUS'!F54","v":0},{"$f":"'72-fund.zarz.przez ZUS'!G54","v":0},{"$f":"'72-fund.zarz.przez ZUS'!D55","v":0},{"$f":"'72-fund.zarz.przez ZUS'!E55","v":0},{"$f":"'72-fund.zarz.przez ZUS'!F55","v":0},{"$f":"'72-fund.zarz.przez ZUS'!G55","v":0},{"$f":"'72-fund.zarz.przez ZUS'!D56","v":0},{"$f":"'72-fund.zarz.przez ZUS'!E56","v":0},{"$f":"'72-fund.zarz.przez ZUS'!F56","v":0},{"$f":"'72-fund.zarz.przez ZUS'!G56","v":0},{"$f":"'72-fund.zarz.przez ZUS'!D57","v":0},{"$f":"'72-fund.zarz.przez ZUS'!E57","v":0},{"$f":"'72-fund.zarz.przez ZUS'!F57","v":0},{"$f":"'72-fund.zarz.przez ZUS'!G57","v":0},{"$f":"'72-fund.zarz.przez ZUS'!D58","v":0},{"$f":"'72-fund.zarz.przez ZUS'!E58","v":0},{"$f":"'72-fund.zarz.przez ZUS'!F58","v":0},{"$f":"'72-fund.zarz.przez ZUS'!G58","v":0},{"$f":"'72-fund.zarz.przez ZUS'!D59","v":0},{"$f":"'72-fund.zarz.przez ZUS'!E59","v":0},{"$f":"'72-fund.zarz.przez ZUS'!F59","v":0},{"$f":"'72-fund.zarz.przez ZUS'!G59","v":0},{"$f":"'72-fund.zarz.przez ZUS'!D60","v":0},{"$f":"'72-fund.zarz.przez ZUS'!E60","v":0},{"$f":"'72-fund.zarz.przez ZUS'!F60","v":0},{"$f":"'72-fund.zarz.przez ZUS'!G60","v":0},{"$f":"'72-fund.zarz.przez ZUS'!D61","v":0},{"$f":"'72-fund.zarz.przez ZUS'!E61","v":0},{"$f":"'72-fund.zarz.przez ZUS'!F61","v":0},{"$f":"'72-fund.zarz.przez ZUS'!G61","v":0},{"$f":"'72-fund.zarz.przez ZUS'!D62","v":0},{"$f":"'72-fund.zarz.przez ZUS'!E62","v":0},{"$f":"'72-fund.zarz.przez ZUS'!F62","v":0},{"$f":"'72-fund.zarz.przez ZUS'!G62","v":0},{"$f":"'72-fund.zarz.przez ZUS'!D63","v":0},{"$f":"'72-fund.zarz.przez ZUS'!E63","v":0},{"$f":"'72-fund.zarz.przez ZUS'!F63","v":0},{"$f":"'72-fund.zarz.przez ZUS'!G63","v":0},{"$f":"'72-fund.zarz.przez ZUS'!D64","v":0},{"$f":"'72-fund.zarz.przez ZUS'!E64","v":0},{"$f":"'72-fund.zarz.przez ZUS'!F64","v":0},{"$f":"'72-fund.zarz.przez ZUS'!G64","v":0},{"$f":"'72-fund.zarz.przez ZUS'!D65","v":0},{"$f":"'72-fund.zarz.przez ZUS'!E65","v":0},{"$f":"'72-fund.zarz.przez ZUS'!F65","v":0},{"$f":"'72-fund.zarz.przez ZUS'!G65","v":0}]
[{"$f":"'73-KRUS'!A8:B8","v":0},null,null,null,null,{"$f":"'73-KRUS'!L11","v":73},{"$f":"'73-KRUS'!K8","v":0},{"$f":"'73-KRUS'!H8","v":4},{"$f":"'73-KRUS'!M11","v":0},null,null,{"$f":"'73-KRUS'!D53","v":0},{"$f":"'73-KRUS'!E53","v":0},{"$f":"'73-KRUS'!F53","v":0},{"$f":"'73-KRUS'!G53","v":0},{"$f":"'73-KRUS'!D54","v":0},{"$f":"'73-KRUS'!E54","v":0},{"$f":"'73-KRUS'!F54","v":0},{"$f":"'73-KRUS'!G54","v":0},{"$f":"'73-KRUS'!D55","v":0},{"$f":"'73-KRUS'!E55","v":0},{"$f":"'73-KRUS'!F55","v":0},{"$f":"'73-KRUS'!G55","v":0},{"$f":"'73-KRUS'!D56","v":0},{"$f":"'73-KRUS'!E56","v":0},{"$f":"'73-KRUS'!F56","v":0},{"$f":"'73-KRUS'!G56","v":0},{"$f":"'73-KRUS'!D57","v":0},{"$f":"'73-KRUS'!E57","v":0},{"$f":"'73-KRUS'!F57","v":0},{"$f":"'73-KRUS'!G57","v":0},{"$f":"'73-KRUS'!D58","v":0},{"$f":"'73-KRUS'!E58","v":0},{"$f":"'73-KRUS'!F58","v":0},{"$f":"'73-KRUS'!G58","v":0},{"$f":"'73-KRUS'!D59","v":0},{"$f":"'73-KRUS'!E59","v":0},{"$f":"'73-KRUS'!F59","v":0},{"$f":"'73-KRUS'!G59","v":0},{"$f":"'73-KRUS'!D60","v":0},{"$f":"'73-KRUS'!E60","v":0},{"$f":"'73-KRUS'!F60","v":0},{"$f":"'73-KRUS'!G60","v":0},{"$f":"'73-KRUS'!D61","v":0},{"$f":"'73-KRUS'!E61","v":0},{"$f":"'73-KRUS'!F61","v":0},{"$f":"'73-KRUS'!G61","v":0},{"$f":"'73-KRUS'!D62","v":0},{"$f":"'73-KRUS'!E62","v":0},{"$f":"'73-KRUS'!F62","v":0},{"$f":"'73-KRUS'!G62","v":0},{"$f":"'73-KRUS'!D63","v":0},{"$f":"'73-KRUS'!E63","v":0},{"$f":"'73-KRUS'!F63","v":0},{"$f":"'73-KRUS'!G63","v":0},{"$f":"'73-KRUS'!D64","v":0},{"$f":"'73-KRUS'!E64","v":0},{"$f":"'73-KRUS'!F64","v":0},{"$f":"'73-KRUS'!G64","v":0},{"$f":"'73-KRUS'!D65","v":0},{"$f":"'73-KRUS'!E65","v":0},{"$f":"'73-KRUS'!F65","v":0},{"$f":"'73-KRUS'!G65","v":0}]
[{"$f":"'81-państw.osoba prawna'!A8","v":0},null,null,null,null,{"$f":"'81-państw.osoba prawna'!L11","v":81},{"$f":"'81-państw.osoba prawna'!K8","v":0},{"$f":"'81-państw.osoba prawna'!H8","v":4},{"$f":"'81-państw.osoba prawna'!M11","v":0},null,null,{"$f":"'81-państw.osoba prawna'!D53","v":0},{"$f":"'81-państw.osoba prawna'!E53","v":0},{"$f":"'81-państw.osoba prawna'!F53","v":0},{"$f":"'81-państw.osoba prawna'!G53","v":0},{"$f":"'81-państw.osoba prawna'!D54","v":0},{"$f":"'81-państw.osoba prawna'!E54","v":0},{"$f":"'81-państw.osoba prawna'!F54","v":0},{"$f":"'81-państw.osoba prawna'!G54","v":0},{"$f":"'81-państw.osoba prawna'!D55","v":0},{"$f":"'81-państw.osoba prawna'!E55","v":0},{"$f":"'81-państw.osoba prawna'!F55","v":0},{"$f":"'81-państw.osoba prawna'!G55","v":0},{"$f":"'81-państw.osoba prawna'!D56","v":0},{"$f":"'81-państw.osoba prawna'!E56","v":0},{"$f":"'81-państw.osoba prawna'!F56","v":0},{"$f":"'81-państw.osoba prawna'!G56","v":0},{"$f":"'81-państw.osoba prawna'!D57","v":0},{"$f":"'81-państw.osoba prawna'!E57","v":0},{"$f":"'81-państw.osoba prawna'!F57","v":0},{"$f":"'81-państw.osoba prawna'!G57","v":0},{"$f":"'81-państw.osoba prawna'!D58","v":0},{"$f":"'81-państw.osoba prawna'!E58","v":0},{"$f":"'81-państw.osoba prawna'!F58","v":0},{"$f":"'81-państw.osoba prawna'!G58","v":0},{"$f":"'81-państw.osoba prawna'!D59","v":0},{"$f":"'81-państw.osoba prawna'!E59","v":0},{"$f":"'81-państw.osoba prawna'!F59","v":0},{"$f":"'81-państw.osoba prawna'!G59","v":0},{"$f":"'81-państw.osoba prawna'!D60","v":0},{"$f":"'81-państw.osoba prawna'!E60","v":0},{"$f":"'81-państw.osoba prawna'!F60","v":0},{"$f":"'81-państw.osoba prawna'!G60","v":0},{"$f":"'81-państw.osoba prawna'!D61","v":0},{"$f":"'81-państw.osoba prawna'!E61","v":0},{"$f":"'81-państw.osoba prawna'!F61","v":0},{"$f":"'81-państw.osoba prawna'!G61","v":0},{"$f":"'81-państw.osoba prawna'!D62","v":0},{"$f":"'81-państw.osoba prawna'!E62","v":0},{"$f":"'81-państw.osoba prawna'!F62","v":0},{"$f":"'81-państw.osoba prawna'!G62","v":0},{"$f":"'81-państw.osoba prawna'!D63","v":0},{"$f":"'81-państw.osoba prawna'!E63","v":0},{"$f":"'81-państw.osoba prawna'!F63","v":0},{"$f":"'81-państw.osoba prawna'!G63","v":0},{"$f":"'81-państw.osoba prawna'!D64","v":0},{"$f":"'81-państw.osoba prawna'!E64","v":0},{"$f":"'81-państw.osoba prawna'!F64","v":0},{"$f":"'81-państw.osoba prawna'!G64","v":0},{"$f":"'81-państw.osoba prawna'!D65","v":0},{"$f":"'81-państw.osoba prawna'!E65","v":0},{"$f":"'81-państw.osoba prawna'!F65","v":0},{"$f":"'81-państw.osoba prawna'!G65","v":0}]
[{"$f":"'82-samorz.osoba prawna'!A8","v":0},null,null,null,null,{"$f":"'82-samorz.osoba prawna'!L11","v":82},{"$f":"'82-samorz.osoba prawna'!K8","v":0},{"$f":"'82-samorz.osoba prawna'!H8","v":4},{"$f":"'82-samorz.osoba prawna'!M11","v":0},null,null,{"$f":"'82-samorz.osoba prawna'!D53","v":0},{"$f":"'82-samorz.osoba prawna'!E53","v":0},{"$f":"'82-samorz.osoba prawna'!F53","v":0},{"$f":"'82-samorz.osoba prawna'!G53","v":0},{"$f":"'82-samorz.osoba prawna'!D54","v":0},{"$f":"'82-samorz.osoba prawna'!E54","v":0},{"$f":"'82-samorz.osoba prawna'!F54","v":0},{"$f":"'82-samorz.osoba prawna'!G54","v":0},{"$f":"'82-samorz.osoba prawna'!D55","v":0},{"$f":"'82-samorz.osoba prawna'!E55","v":0},{"$f":"'82-samorz.osoba prawna'!F55","v":0},{"$f":"'82-samorz.osoba prawna'!G55","v":0},{"$f":"'82-samorz.osoba prawna'!D56","v":0},{"$f":"'82-samorz.osoba prawna'!E56","v":0},{"$f":"'82-samorz.osoba prawna'!F56","v":0},{"$f":"'82-samorz.osoba prawna'!G56","v":0},{"$f":"'82-samorz.osoba prawna'!D57","v":0},{"$f":"'82-samorz.osoba prawna'!E57","v":0},{"$f":"'82-samorz.osoba prawna'!F57","v":0},{"$f":"'82-samorz.osoba prawna'!G57","v":0},{"$f":"'82-samorz.osoba prawna'!D58","v":0},{"$f":"'82-samorz.osoba prawna'!E58","v":0},{"$f":"'82-samorz.osoba prawna'!F58","v":0},{"$f":"'82-samorz.osoba prawna'!G58","v":0},{"$f":"'82-samorz.osoba prawna'!D59","v":0},{"$f":"'82-samorz.osoba prawna'!E59","v":0},{"$f":"'82-samorz.osoba prawna'!F59","v":0},{"$f":"'82-samorz.osoba prawna'!G59","v":0},{"$f":"'82-samorz.osoba prawna'!D60","v":0},{"$f":"'82-samorz.osoba prawna'!E60","v":0},{"$f":"'82-samorz.osoba prawna'!F60","v":0},{"$f":"'82-samorz.osoba prawna'!G60","v":0},{"$f":"'82-samorz.osoba prawna'!D61","v":0},{"$f":"'82-samorz.osoba prawna'!E61","v":0},{"$f":"'82-samorz.osoba prawna'!F61","v":0},{"$f":"'82-samorz.osoba prawna'!G61","v":0},{"$f":"'82-samorz.osoba prawna'!D62","v":0},{"$f":"'82-samorz.osoba prawna'!E62","v":0},{"$f":"'82-samorz.osoba prawna'!F62","v":0},{"$f":"'82-samorz.osoba prawna'!G62","v":0},{"$f":"'82-samorz.osoba prawna'!D63","v":0},{"$f":"'82-samorz.osoba prawna'!E63","v":0},{"$f":"'82-samorz.osoba prawna'!F63","v":0},{"$f":"'82-samorz.osoba prawna'!G63","v":0},{"$f":"'82-samorz.osoba prawna'!D64","v":0},{"$f":"'82-samorz.osoba prawna'!E64","v":0},{"$f":"'82-samorz.osoba prawna'!F64","v":0},{"$f":"'82-samorz.osoba prawna'!G64","v":0},{"$f":"'82-samorz.osoba prawna'!D65","v":0},{"$f":"'82-samorz.osoba prawna'!E65","v":0},{"$f":"'82-samorz.osoba prawna'!F65","v":0},{"$f":"'82-samorz.osoba prawna'!G65","v":0}]
[{"$f":"'90-agencja wykonawcza'!A8","v":0},null,null,null,null,{"$f":"'90-agencja wykonawcza'!L11","v":90},{"$f":"'90-agencja wykonawcza'!K8","v":0},{"$f":"'90-agencja wykonawcza'!H8","v":4},{"$f":"'90-agencja wykonawcza'!M11","v":0},null,null,{"$f":"'90-agencja wykonawcza'!D53","v":0},{"$f":"'90-agencja wykonawcza'!E53","v":0},{"$f":"'90-agencja wykonawcza'!F53","v":0},{"$f":"'90-agencja wykonawcza'!G53","v":0},{"$f":"'90-agencja wykonawcza'!D54","v":0},{"$f":"'90-agencja wykonawcza'!E54","v":0},{"$f":"'90-agencja wykonawcza'!F54","v":0},{"$f":"'90-agencja wykonawcza'!G54","v":0},{"$f":"'90-agencja wykonawcza'!D55","v":0},{"$f":"'90-agencja wykonawcza'!E55","v":0},{"$f":"'90-agencja wykonawcza'!F55","v":0},{"$f":"'90-agencja wykonawcza'!G55","v":0},{"$f":"'90-agencja wykonawcza'!D56","v":0},{"$f":"'90-agencja wykonawcza'!E56","v":0},{"$f":"'90-agencja wykonawcza'!F56","v":0},{"$f":"'90-agencja wykonawcza'!G56","v":0},{"$f":"'90-agencja wykonawcza'!D57","v":0},{"$f":"'90-agencja wykonawcza'!E57","v":0},{"$f":"'90-agencja wykonawcza'!F57","v":0},{"$f":"'90-agencja wykonawcza'!G57","v":0},{"$f":"'90-agencja wykonawcza'!D58","v":0},{"$f":"'90-agencja wykonawcza'!E58","v":0},{"$f":"'90-agencja wykonawcza'!F58","v":0},{"$f":"'90-agencja wykonawcza'!G58","v":0},{"$f":"'90-agencja wykonawcza'!D59","v":0},{"$f":"'90-agencja wykonawcza'!E59","v":0},{"$f":"'90-agencja wykonawcza'!F59","v":0},{"$f":"'90-agencja wykonawcza'!G59","v":0},{"$f":"'90-agencja wykonawcza'!D60","v":0},{"$f":"'90-agencja wykonawcza'!E60","v":0},{"$f":"'90-agencja wykonawcza'!F60","v":0},{"$f":"'90-agencja wykonawcza'!G60","v":0},{"$f":"'90-agencja wykonawcza'!D61","v":0},{"$f":"'90-agencja wykonawcza'!E61","v":0},{"$f":"'90-agencja wykonawcza'!F61","v":0},{"$f":"'90-agencja wykonawcza'!G61","v":0},{"$f":"'90-agencja wykonawcza'!D62","v":0},{"$f":"'90-agencja wykonawcza'!E62","v":0},{"$f":"'90-agencja wykonawcza'!F62","v":0},{"$f":"'90-agencja wykonawcza'!G62","v":0},{"$f":"'90-agencja wykonawcza'!D63","v":0},{"$f":"'90-agencja wykonawcza'!E63","v":0},{"$f":"'90-agencja wykonawcza'!F63","v":0},{"$f":"'90-agencja wykonawcza'!G63","v":0},{"$f":"'90-agencja wykonawcza'!D64","v":0},{"$f":"'90-agencja wykonawcza'!E64","v":0},{"$f":"'90-agencja wykonawcza'!F64","v":0},{"$f":"'90-agencja wykonawcza'!G64","v":0},{"$f":"'90-agencja wykonawcza'!D65","v":0},{"$f":"'90-agencja wykonawcza'!E65","v":0},{"$f":"'90-agencja wykonawcza'!F65","v":0},{"$f":"'90-agencja wykonawcza'!G65","v":0}]
[{"$f":"'99-zbiorczo'!A8","v":"Brak nr REGON"},null,null,null,null,{"$f":"'99-zbiorczo'!L11","v":99},{"$f":"'99-zbiorczo'!K8","v":"Brak roku"},{"$f":"'99-zbiorczo'!H8","v":4},{"$f":"'99-zbiorczo'!M11","v":0},null,null,{"$f":"'99-zbiorczo'!D53","v":0},{"$f":"'99-zbiorczo'!E53","v":0},{"$f":"'99-zbiorczo'!F53","v":0},{"$f":"'99-zbiorczo'!G53","v":0},{"$f":"'99-zbiorczo'!D54","v":0},{"$f":"'99-zbiorczo'!E54","v":0},{"$f":"'99-zbiorczo'!F54","v":0},{"$f":"'99-zbiorczo'!G54","v":0},{"$f":"'99-zbiorczo'!D55","v":0},{"$f":"'99-zbiorczo'!E55","v":0},{"$f":"'99-zbiorczo'!F55","v":0},{"$f":"'99-zbiorczo'!G55","v":0},{"$f":"'99-zbiorczo'!D56","v":0},{"$f":"'99-zbiorczo'!E56","v":0},{"$f":"'99-zbiorczo'!F56","v":0},{"$f":"'99-zbiorczo'!G56","v":0},{"$f":"'99-zbiorczo'!D57","v":0},{"$f":"'99-zbiorczo'!E57","v":0},{"$f":"'99-zbiorczo'!F57","v":0},{"$f":"'99-zbiorczo'!G57","v":0},{"$f":"'99-zbiorczo'!D58","v":0},{"$f":"'99-zbiorczo'!E58","v":0},{"$f":"'99-zbiorczo'!F58","v":0},{"$f":"'99-zbiorczo'!G58","v":0},{"$f":"'99-zbiorczo'!D59","v":0},{"$f":"'99-zbiorczo'!E59","v":0},{"$f":"'99-zbiorczo'!F59","v":0},{"$f":"'99-zbiorczo'!G59","v":0},{"$f":"'99-zbiorczo'!D60","v":0},{"$f":"'99-zbiorczo'!E60","v":0},{"$f":"'99-zbiorczo'!F60","v":0},{"$f":"'99-zbiorczo'!G60","v":0},{"$f":"'99-zbiorczo'!D61","v":0},{"$f":"'99-zbiorczo'!E61","v":0},{"$f":"'99-zbiorczo'!F61","v":0},{"$f":"'99-zbiorczo'!G61","v":0},{"$f":"'99-zbiorczo'!D62","v":0},{"$f":"'99-zbiorczo'!E62","v":0},{"$f":"'99-zbiorczo'!F62","v":0},{"$f":"'99-zbiorczo'!G62","v":0},{"$f":"'99-zbiorczo'!D63","v":0},{"$f":"'99-zbiorczo'!E63","v":0},{"$f":"'99-zbiorczo'!F63","v":0},{"$f":"'99-zbiorczo'!G63","v":0},{"$f":"'99-zbiorczo'!D64","v":0},{"$f":"'99-zbiorczo'!E64","v":0},{"$f":"'99-zbiorczo'!F64","v":0},{"$f":"'99-zbiorczo'!G64","v":0},{"$f":"'99-zbiorczo'!D65","v":0},{"$f":"'99-zbiorczo'!E65","v":0},{"$f":"'99-zbiorczo'!F65","v":0},{"$f":"'99-zbiorczo'!G65","v":0}]

{"sheet":"RBUZB4","index":20,"n_rows":17,"n_cols":63,"rows_kept":17,"cut":false,"hidden":true,"merged":[]}
["REGON","WK","PK","GK","GT","PT","ROK","KWARTAL","CZ_BU","DAT_SKW","UWAGI","B40102","B40103","B40104","B40105","B40202","B40203","B40204","B40205","B40302","B40303","B40304","B40305","B40402","B40403","B40404","B40405","B40502","B40503","B40504","B40505","B40602","B40603","B40604","B40605","B40702","B40703","B40704","B40705","B40802","B40803","B40804","B40805","B40902","B40903","B40904","B40905","B41002","B41003","B41004","B41005","B41102","B41103","B41104","B41105","B41202","B41203","B41204","B41205","B4302","B4303","B4304","B4305"]
[{"$f":"'11-państw.fund.cel.'!A8","v":0},null,null,null,null,{"$f":"'11-państw.fund.cel.'!L11","v":11},{"$f":"'11-państw.fund.cel.'!K8","v":0},{"$f":"'11-państw.fund.cel.'!H8","v":4},{"$f":"'11-państw.fund.cel.'!M11","v":0},null,null,{"$f":"'11-państw.fund.cel.'!M53","v":0},{"$f":"'11-państw.fund.cel.'!N53","v":0},{"$f":"'11-państw.fund.cel.'!O53","v":0},{"$f":"'11-państw.fund.cel.'!P53","v":0},{"$f":"'11-państw.fund.cel.'!M54","v":0},{"$f":"'11-państw.fund.cel.'!N54","v":0},{"$f":"'11-państw.fund.cel.'!O54","v":0},{"$f":"'11-państw.fund.cel.'!P54","v":0},{"$f":"'11-państw.fund.cel.'!M55","v":0},{"$f":"'11-państw.fund.cel.'!N55","v":0},{"$f":"'11-państw.fund.cel.'!O55","v":0},{"$f":"'11-państw.fund.cel.'!P55","v":0},{"$f":"'11-państw.fund.cel.'!M56","v":0},{"$f":"'11-państw.fund.cel.'!N56","v":0},{"$f":"'11-państw.fund.cel.'!O56","v":0},{"$f":"'11-państw.fund.cel.'!P56","v":0},{"$f":"'11-państw.fund.cel.'!M57","v":0},{"$f":"'11-państw.fund.cel.'!N57","v":0},{"$f":"'11-państw.fund.cel.'!O57","v":0},{"$f":"'11-państw.fund.cel.'!P57","v":0},{"$f":"'11-państw.fund.cel.'!M58","v":0},{"$f":"'11-państw.fund.cel.'!N58","v":0},{"$f":"'11-państw.fund.cel.'!O58","v":0},{"$f":"'11-państw.fund.cel.'!P58","v":0},{"$f":"'11-państw.fund.cel.'!M59","v":0},{"$f":"'11-państw.fund.cel.'!N59","v":0},{"$f":"'11-państw.fund.cel.'!O59","v":0},{"$f":"'11-państw.fund.cel.'!P59","v":0},{"$f":"'11-państw.fund.cel.'!M60","v":0},{"$f":"'11-państw.fund.cel.'!N60","v":0},{"$f":"'11-państw.fund.cel.'!O60","v":0},{"$f":"'11-państw.fund.cel.'!P60","v":0},{"$f":"'11-państw.fund.cel.'!M61","v":0},{"$f":"'11-państw.fund.cel.'!N61","v":0},{"$f":"'11-państw.fund.cel.'!O61","v":0},{"$f":"'11-państw.fund.cel.'!P61","v":0},{"$f":"'11-państw.fund.cel.'!M62","v":0},{"$f":"'11-państw.fund.cel.'!N62","v":0},{"$f":"'11-państw.fund.cel.'!O62","v":0},{"$f":"'11-państw.fund.cel.'!P62","v":0},{"$f":"'11-państw.fund.cel.'!M63","v":0},{"$f":"'11-państw.fund.cel.'!N63","v":0},{"$f":"'11-państw.fund.cel.'!O63","v":0},{"$f":"'11-państw.fund.cel.'!P63","v":0},{"$f":"'11-państw.fund.cel.'!M64","v":0},{"$f":"'11-państw.fund.cel.'!N64","v":0},{"$f":"'11-państw.fund.cel.'!O64","v":0},{"$f":"'11-państw.fund.cel.'!P64","v":0},{"$f":"'11-państw.fund.cel.'!M65","v":0},{"$f":"'11-państw.fund.cel.'!N65","v":0},{"$f":"'11-państw.fund.cel.'!O65","v":0},{"$f":"'11-państw.fund.cel.'!P65","v":0}]
[{"$f":"'20-państw.szk.wyż.'!A8","v":0},null,null,null,null,{"$f":"'20-państw.szk.wyż.'!L11","v":20},{"$f":"'20-państw.szk.wyż.'!K8","v":0},{"$f":"'20-państw.szk.wyż.'!H8","v":4},{"$f":"'20-państw.szk.wyż.'!M11","v":0},null,null,{"$f":"'20-państw.szk.wyż.'!M53","v":0},{"$f":"'20-państw.szk.wyż.'!N53","v":0},{"$f":"'20-państw.szk.wyż.'!O53","v":0},{"$f":"'20-państw.szk.wyż.'!P53","v":0},{"$f":"'20-państw.szk.wyż.'!M54","v":0},{"$f":"'20-państw.szk.wyż.'!N54","v":0},{"$f":"'20-państw.szk.wyż.'!O54","v":0},{"$f":"'20-państw.szk.wyż.'!P54","v":0},{"$f":"'20-państw.szk.wyż.'!M55","v":0},{"$f":"'20-państw.szk.wyż.'!N55","v":0},{"$f":"'20-państw.szk.wyż.'!O55","v":0},{"$f":"'20-państw.szk.wyż.'!P55","v":0},{"$f":"'20-państw.szk.wyż.'!M56","v":0},{"$f":"'20-państw.szk.wyż.'!N56","v":0},{"$f":"'20-państw.szk.wyż.'!O56","v":0},{"$f":"'20-państw.szk.wyż.'!P56","v":0},{"$f":"'20-państw.szk.wyż.'!M57","v":0},{"$f":"'20-państw.szk.wyż.'!N57","v":0},{"$f":"'20-państw.szk.wyż.'!O57","v":0},{"$f":"'20-państw.szk.wyż.'!P57","v":0},{"$f":"'20-państw.szk.wyż.'!M58","v":0},{"$f":"'20-państw.szk.wyż.'!N58","v":0},{"$f":"'20-państw.szk.wyż.'!O58","v":0},{"$f":"'20-państw.szk.wyż.'!P58","v":0},{"$f":"'20-państw.szk.wyż.'!M59","v":0},{"$f":"'20-państw.szk.wyż.'!N59","v":0},{"$f":"'20-państw.szk.wyż.'!O59","v":0},{"$f":"'20-państw.szk.wyż.'!P59","v":0},{"$f":"'20-państw.szk.wyż.'!M60","v":0},{"$f":"'20-państw.szk.wyż.'!N60","v":0},{"$f":"'20-państw.szk.wyż.'!O60","v":0},{"$f":"'20-państw.szk.wyż.'!P60","v":0},{"$f":"'20-państw.szk.wyż.'!M61","v":0},{"$f":"'20-państw.szk.wyż.'!N61","v":0},{"$f":"'20-państw.szk.wyż.'!O61","v":0},{"$f":"'20-państw.szk.wyż.'!P61","v":0},{"$f":"'20-państw.szk.wyż.'!M62","v":0},{"$f":"'20-państw.szk.wyż.'!N62","v":0},{"$f":"'20-państw.szk.wyż.'!O62","v":0},{"$f":"'20-państw.szk.wyż.'!P62","v":0},{"$f":"'20-państw.szk.wyż.'!M63","v":0},{"$f":"'20-państw.szk.wyż.'!N63","v":0},{"$f":"'20-państw.szk.wyż.'!O63","v":0},{"$f":"'20-państw.szk.wyż.'!P63","v":0},{"$f":"'20-państw.szk.wyż.'!M64","v":0},{"$f":"'20-państw.szk.wyż.'!N64","v":0},{"$f":"'20-państw.szk.wyż.'!O64","v":0},{"$f":"'20-państw.szk.wyż.'!P64","v":0},{"$f":"'20-państw.szk.wyż.'!M65","v":0},{"$f":"'20-państw.szk.wyż.'!N65","v":0},{"$f":"'20-państw.szk.wyż.'!O65","v":0},{"$f":"'20-państw.szk.wyż.'!P65","v":0}]
[{"$f":"'31-instytucje gosp budż'!A8","v":0},null,null,null,null,{"$f":"'31-instytucje gosp budż'!L11","v":31},{"$f":"'31-instytucje gosp budż'!K8","v":0},{"$f":"'31-instytucje gosp budż'!H8","v":4},{"$f":"'31-instytucje gosp budż'!M11","v":0},null,null,{"$f":"'31-instytucje gosp budż'!M53","v":0},{"$f":"'31-instytucje gosp budż'!N53","v":0},{"$f":"'31-instytucje gosp budż'!O53","v":0},{"$f":"'31-instytucje gosp budż'!P53","v":0},{"$f":"'31-instytucje gosp budż'!M54","v":0},{"$f":"'31-instytucje gosp budż'!N54","v":0},{"$f":"'31-instytucje gosp budż'!O54","v":0},{"$f":"'31-instytucje gosp budż'!P54","v":0},{"$f":"'31-instytucje gosp budż'!M55","v":0},{"$f":"'31-instytucje gosp budż'!N55","v":0},{"$f":"'31-instytucje gosp budż'!O55","v":0},{"$f":"'31-instytucje gosp budż'!P55","v":0},{"$f":"'31-instytucje gosp budż'!M56","v":0},{"$f":"'31-instytucje gosp budż'!N56","v":0},{"$f":"'31-instytucje gosp budż'!O56","v":0},{"$f":"'31-instytucje gosp budż'!P56","v":0},{"$f":"'31-instytucje gosp budż'!M57","v":0},{"$f":"'31-instytucje gosp budż'!N57","v":0},{"$f":"'31-instytucje gosp budż'!O57","v":0},{"$f":"'31-instytucje gosp budż'!P57","v":0},{"$f":"'31-instytucje gosp budż'!M58","v":0},{"$f":"'31-instytucje gosp budż'!N58","v":0},{"$f":"'31-instytucje gosp budż'!O58","v":0},{"$f":"'31-instytucje gosp budż'!P58","v":0},{"$f":"'31-instytucje gosp budż'!M59","v":0},{"$f":"'31-instytucje gosp budż'!N59","v":0},{"$f":"'31-instytucje gosp budż'!O59","v":0},{"$f":"'31-instytucje gosp budż'!P59","v":0},{"$f":"'31-instytucje gosp budż'!M60","v":0},{"$f":"'31-instytucje gosp budż'!N60","v":0},{"$f":"'31-instytucje gosp budż'!O60","v":0},{"$f":"'31-instytucje gosp budż'!P60","v":0},{"$f":"'31-instytucje gosp budż'!M61","v":0},{"$f":"'31-instytucje gosp budż'!N61","v":0},{"$f":"'31-instytucje gosp budż'!O61","v":0},{"$f":"'31-instytucje gosp budż'!P61","v":0},{"$f":"'31-instytucje gosp budż'!M62","v":0},{"$f":"'31-instytucje gosp budż'!N62","v":0},{"$f":"'31-instytucje gosp budż'!O62","v":0},{"$f":"'31-instytucje gosp budż'!P62","v":0},{"$f":"'31-instytucje gosp budż'!M63","v":0},{"$f":"'31-instytucje gosp budż'!N63","v":0},{"$f":"'31-instytucje gosp budż'!O63","v":0},{"$f":"'31-instytucje gosp budż'!P63","v":0},{"$f":"'31-instytucje gosp budż'!M64","v":0},{"$f":"'31-instytucje gosp budż'!N64","v":0},{"$f":"'31-instytucje gosp budż'!O64","v":0},{"$f":"'31-instytucje gosp budż'!P64","v":0},{"$f":"'31-instytucje gosp budż'!M65","v":0},{"$f":"'31-instytucje gosp budż'!N65","v":0},{"$f":"'31-instytucje gosp budż'!O65","v":0},{"$f":"'31-instytucje gosp budż'!P65","v":0}]
[{"$f":"'41-państw.inst.kult.'!A8","v":0},null,null,null,null,{"$f":"'41-państw.inst.kult.'!L11","v":41},{"$f":"'41-państw.inst.kult.'!K8","v":0},{"$f":"'41-państw.inst.kult.'!H8","v":4},{"$f":"'41-państw.inst.kult.'!M11","v":0},null,null,{"$f":"'41-państw.inst.kult.'!M53","v":0},{"$f":"'41-państw.inst.kult.'!N53","v":0},{"$f":"'41-państw.inst.kult.'!O53","v":0},{"$f":"'41-państw.inst.kult.'!P53","v":0},{"$f":"'41-państw.inst.kult.'!M54","v":0},{"$f":"'41-państw.inst.kult.'!N54","v":0},{"$f":"'41-państw.inst.kult.'!O54","v":0},{"$f":"'41-państw.inst.kult.'!P54","v":0},{"$f":"'41-państw.inst.kult.'!M55","v":0},{"$f":"'41-państw.inst.kult.'!N55","v":0},{"$f":"'41-państw.inst.kult.'!O55","v":0},{"$f":"'41-państw.inst.kult.'!P55","v":0},{"$f":"'41-państw.inst.kult.'!M56","v":0},{"$f":"'41-państw.inst.kult.'!N56","v":0},{"$f":"'41-państw.inst.kult.'!O56","v":0},{"$f":"'41-państw.inst.kult.'!P56","v":0},{"$f":"'41-państw.inst.kult.'!M57","v":0},{"$f":"'41-państw.inst.kult.'!N57","v":0},{"$f":"'41-państw.inst.kult.'!O57","v":0},{"$f":"'41-państw.inst.kult.'!P57","v":0},{"$f":"'41-państw.inst.kult.'!M58","v":0},{"$f":"'41-państw.inst.kult.'!N58","v":0},{"$f":"'41-państw.inst.kult.'!O58","v":0},{"$f":"'41-państw.inst.kult.'!P58","v":0},{"$f":"'41-państw.inst.kult.'!M59","v":0},{"$f":"'41-państw.inst.kult.'!N59","v":0},{"$f":"'41-państw.inst.kult.'!O59","v":0},{"$f":"'41-państw.inst.kult.'!P59","v":0},{"$f":"'41-państw.inst.kult.'!M60","v":0},{"$f":"'41-państw.inst.kult.'!N60","v":0},{"$f":"'41-państw.inst.kult.'!O60","v":0},{"$f":"'41-państw.inst.kult.'!P60","v":0},{"$f":"'41-państw.inst.kult.'!M61","v":0},{"$f":"'41-państw.inst.kult.'!N61","v":0},{"$f":"'41-państw.inst.kult.'!O61","v":0},{"$f":"'41-państw.inst.kult.'!P61","v":0},{"$f":"'41-państw.inst.kult.'!M62","v":0},{"$f":"'41-państw.inst.kult.'!N62","v":0},{"$f":"'41-państw.inst.kult.'!O62","v":0},{"$f":"'41-państw.inst.kult.'!P62","v":0},{"$f":"'41-państw.inst.kult.'!M63","v":0},{"$f":"'41-państw.inst.kult.'!N63","v":0},{"$f":"'41-państw.inst.kult.'!O63","v":0},{"$f":"'41-państw.inst.kult.'!P63","v":0},{"$f":"'41-państw.inst.kult.'!M64","v":0},{"$f":"'41-państw.inst.kult.'!N64","v":0},{"$f":"'41-państw.inst.kult.'!O64","v":0},{"$f":"'41-państw.inst.kult.'!P64","v":0},{"$f":"'41-państw.inst.kult.'!M65","v":0},{"$f":"'41-państw.inst.kult.'!N65","v":0},{"$f":"'41-państw.inst.kult.'!O65","v":0},{"$f":"'41-państw.inst.kult.'!P65","v":0}]
[{"$f":"'42-samorz.inst.kult.'!A8","v":0},null,null,null,null,{"$f":"'42-samorz.inst.kult.'!L11","v":42},{"$f":"'42-samorz.inst.kult.'!K8","v":0},{"$f":"'42-samorz.inst.kult.'!H8","v":4},{"$f":"'42-samorz.inst.kult.'!M11","v":0},null,null,{"$f":"'42-samorz.inst.kult.'!M53","v":0},{"$f":"'42-samorz.inst.kult.'!N53","v":0},{"$f":"'42-samorz.inst.kult.'!O53","v":0},{"$f":"'42-samorz.inst.kult.'!P53","v":0},{"$f":"'42-samorz.inst.kult.'!M54","v":0},{"$f":"'42-samorz.inst.kult.'!N54","v":0},{"$f":"'42-samorz.inst.kult.'!O54","v":0},{"$f":"'42-samorz.inst.kult.'!P54","v":0},{"$f":"'42-samorz.inst.kult.'!M55","v":0},{"$f":"'42-samorz.inst.kult.'!N55","v":0},{"$f":"'42-samorz.inst.kult.'!O55","v":0},{"$f":"'42-samorz.inst.kult.'!P55","v":0},{"$f":"'42-samorz.inst.kult.'!M56","v":0},{"$f":"'42-samorz.inst.kult.'!N56","v":0},{"$f":"'42-samorz.inst.kult.'!O56","v":0},{"$f":"'42-samorz.inst.kult.'!P56","v":0},{"$f":"'42-samorz.inst.kult.'!M57","v":0},{"$f":"'42-samorz.inst.kult.'!N57","v":0},{"$f":"'42-samorz.inst.kult.'!O57","v":0},{"$f":"'42-samorz.inst.kult.'!P57","v":0},{"$f":"'42-samorz.inst.kult.'!M58","v":0},{"$f":"'42-samorz.inst.kult.'!N58","v":0},{"$f":"'42-samorz.inst.kult.'!O58","v":0},{"$f":"'42-samorz.inst.kult.'!P58","v":0},{"$f":"'42-samorz.inst.kult.'!M59","v":0},{"$f":"'42-samorz.inst.kult.'!N59","v":0},{"$f":"'42-samorz.inst.kult.'!O59","v":0},{"$f":"'42-samorz.inst.kult.'!P59","v":0},{"$f":"'42-samorz.inst.kult.'!M60","v":0},{"$f":"'42-samorz.inst.kult.'!N60","v":0},{"$f":"'42-samorz.inst.kult.'!O60","v":0},{"$f":"'42-samorz.inst.kult.'!P60","v":0},{"$f":"'42-samorz.inst.kult.'!M61","v":0},{"$f":"'42-samorz.inst.kult.'!N61","v":0},{"$f":"'42-samorz.inst.kult.'!O61","v":0},{"$f":"'42-samorz.inst.kult.'!P61","v":0},{"$f":"'42-samorz.inst.kult.'!M62","v":0},{"$f":"'42-samorz.inst.kult.'!N62","v":0},{"$f":"'42-samorz.inst.kult.'!O62","v":0},{"$f":"'42-samorz.inst.kult.'!P62","v":0},{"$f":"'42-samorz.inst.kult.'!M63","v":0},{"$f":"'42-samorz.inst.kult.'!N63","v":0},{"$f":"'42-samorz.inst.kult.'!O63","v":0},{"$f":"'42-samorz.inst.kult.'!P63","v":0},{"$f":"'42-samorz.inst.kult.'!M64","v":0},{"$f":"'42-samorz.inst.kult.'!N64","v":0},{"$f":"'42-samorz.inst.kult.'!O64","v":0},{"$f":"'42-samorz.inst.kult.'!P64","v":0},{"$f":"'42-samorz.inst.kult.'!M65","v":0},{"$f":"'42-samorz.inst.kult.'!N65","v":0},{"$f":"'42-samorz.inst.kult.'!O65","v":0},{"$f":"'42-samorz.inst.kult.'!P65","v":0}]
[{"$f":"'50-PAN i jedn.tworz.przez PAN'!A8","v":0},null,null,null,null,{"$f":"'50-PAN i jedn.tworz.przez PAN'!L11","v":50},{"$f":"'50-PAN i jedn.tworz.przez PAN'!K8","v":0},{"$f":"'50-PAN i jedn.tworz.przez PAN'!H8","v":4},{"$f":"'50-PAN i jedn.tworz.przez PAN'!M11","v":0},null,null,{"$f":"'50-PAN i jedn.tworz.przez PAN'!M53","v":0},{"$f":"'50-PAN i jedn.tworz.przez PAN'!N53","v":0},{"$f":"'50-PAN i jedn.tworz.przez PAN'!O53","v":0},{"$f":"'50-PAN i jedn.tworz.przez PAN'!P53","v":0},{"$f":"'50-PAN i jedn.tworz.przez PAN'!M54","v":0},{"$f":"'50-PAN i jedn.tworz.przez PAN'!N54","v":0},{"$f":"'50-PAN i jedn.tworz.przez PAN'!O54","v":0},{"$f":"'50-PAN i jedn.tworz.przez PAN'!P54","v":0},{"$f":"'50-PAN i jedn.tworz.przez PAN'!M55","v":0},{"$f":"'50-PAN i jedn.tworz.przez PAN'!N55","v":0},{"$f":"'50-PAN i jedn.tworz.przez PAN'!O55","v":0},{"$f":"'50-PAN i jedn.tworz.przez PAN'!P55","v":0},{"$f":"'50-PAN i jedn.tworz.przez PAN'!M56","v":0},{"$f":"'50-PAN i jedn.tworz.przez PAN'!N56","v":0},{"$f":"'50-PAN i jedn.tworz.przez PAN'!O56","v":0},{"$f":"'50-PAN i jedn.tworz.przez PAN'!P56","v":0},{"$f":"'50-PAN i jedn.tworz.przez PAN'!M57","v":0},{"$f":"'50-PAN i jedn.tworz.przez PAN'!N57","v":0},{"$f":"'50-PAN i jedn.tworz.przez PAN'!O57","v":0},{"$f":"'50-PAN i jedn.tworz.przez PAN'!P57","v":0},{"$f":"'50-PAN i jedn.tworz.przez PAN'!M58","v":0},{"$f":"'50-PAN i jedn.tworz.przez PAN'!N58","v":0},{"$f":"'50-PAN i jedn.tworz.przez PAN'!O58","v":0},{"$f":"'50-PAN i jedn.tworz.przez PAN'!P58","v":0},{"$f":"'50-PAN i jedn.tworz.przez PAN'!M59","v":0},{"$f":"'50-PAN i jedn.tworz.przez PAN'!N59","v":0},{"$f":"'50-PAN i jedn.tworz.przez PAN'!O59","v":0},{"$f":"'50-PAN i jedn.tworz.przez PAN'!P59","v":0},{"$f":"'50-PAN i jedn.tworz.przez PAN'!M60","v":0},{"$f":"'50-PAN i jedn.tworz.przez PAN'!N60","v":0},{"$f":"'50-PAN i jedn.tworz.przez PAN'!O60","v":0},{"$f":"'50-PAN i jedn.tworz.przez PAN'!P60","v":0},{"$f":"'50-PAN i jedn.tworz.przez PAN'!M61","v":0},{"$f":"'50-PAN i jedn.tworz.przez PAN'!N61","v":0},{"$f":"'50-PAN i jedn.tworz.przez PAN'!O61","v":0},{"$f":"'50-PAN i jedn.tworz.przez PAN'!P61","v":0},{"$f":"'50-PAN i jedn.tworz.przez PAN'!M62","v":0},{"$f":"'50-PAN i jedn.tworz.przez PAN'!N62","v":0},{"$f":"'50-PAN i jedn.tworz.przez PAN'!O62","v":0},{"$f":"'50-PAN i jedn.tworz.przez PAN'!P62","v":0},{"$f":"'50-PAN i jedn.tworz.przez PAN'!M63","v":0},{"$f":"'50-PAN i jedn.tworz.przez PAN'!N63","v":0},{"$f":"'50-PAN i jedn.tworz.przez PAN'!O63","v":0},{"$f":"'50-PAN i jedn.tworz.przez PAN'!P63","v":0},{"$f":"'50-PAN i jedn.tworz.przez PAN'!M64","v":0},{"$f":"'50-PAN i jedn.tworz.przez PAN'!N64","v":0},{"$f":"'50-PAN i jedn.tworz.przez PAN'!O64","v":0},{"$f":"'50-PAN i jedn.tworz.przez PAN'!P64","v":0},{"$f":"'50-PAN i jedn.tworz.przez PAN'!M65","v":0},{"$f":"'50-PAN i jedn.tworz.przez PAN'!N65","v":0},{"$f":"'50-PAN i jedn.tworz.przez PAN'!O65","v":0},{"$f":"'50-PAN i jedn.tworz.przez PAN'!P65","v":0}]
[{"$f":"'61-samodz.publ.ZOZ państw.'!A8","v":0},null,null,null,null,{"$f":"'61-samodz.publ.ZOZ państw.'!L11","v":61},{"$f":"'61-samodz.publ.ZOZ państw.'!K8","v":0},{"$f":"'61-samodz.publ.ZOZ państw.'!H8","v":4},{"$f":"'61-samodz.publ.ZOZ państw.'!M11","v":0},null,null,{"$f":"'61-samodz.publ.ZOZ państw.'!M53","v":0},{"$f":"'61-samodz.publ.ZOZ państw.'!N53","v":0},{"$f":"'61-samodz.publ.ZOZ państw.'!O53","v":0},{"$f":"'61-samodz.publ.ZOZ państw.'!P53","v":0},{"$f":"'61-samodz.publ.ZOZ państw.'!M54","v":0},{"$f":"'61-samodz.publ.ZOZ państw.'!N54","v":0},{"$f":"'61-samodz.publ.ZOZ państw.'!O54","v":0},{"$f":"'61-samodz.publ.ZOZ państw.'!P54","v":0},{"$f":"'61-samodz.publ.ZOZ państw.'!M55","v":0},{"$f":"'61-samodz.publ.ZOZ państw.'!N55","v":0},{"$f":"'61-samodz.publ.ZOZ państw.'!O55","v":0},{"$f":"'61-samodz.publ.ZOZ państw.'!P55","v":0},{"$f":"'61-samodz.publ.ZOZ państw.'!M56","v":0},{"$f":"'61-samodz.publ.ZOZ państw.'!N56","v":0},{"$f":"'61-samodz.publ.ZOZ państw.'!O56","v":0},{"$f":"'61-samodz.publ.ZOZ państw.'!P56","v":0},{"$f":"'61-samodz.publ.ZOZ państw.'!M57","v":0},{"$f":"'61-samodz.publ.ZOZ państw.'!N57","v":0},{"$f":"'61-samodz.publ.ZOZ państw.'!O57","v":0},{"$f":"'61-samodz.publ.ZOZ państw.'!P57","v":0},{"$f":"'61-samodz.publ.ZOZ państw.'!M58","v":0},{"$f":"'61-samodz.publ.ZOZ państw.'!N58","v":0},{"$f":"'61-samodz.publ.ZOZ państw.'!O58","v":0},{"$f":"'61-samodz.publ.ZOZ państw.'!P58","v":0},{"$f":"'61-samodz.publ.ZOZ państw.'!M59","v":0},{"$f":"'61-samodz.publ.ZOZ państw.'!N59","v":0},{"$f":"'61-samodz.publ.ZOZ państw.'!O59","v":0},{"$f":"'61-samodz.publ.ZOZ państw.'!P59","v":0},{"$f":"'61-samodz.publ.ZOZ państw.'!M60","v":0},{"$f":"'61-samodz.publ.ZOZ państw.'!N60","v":0},{"$f":"'61-samodz.publ.ZOZ państw.'!O60","v":0},{"$f":"'61-samodz.publ.ZOZ państw.'!P60","v":0},{"$f":"'61-samodz.publ.ZOZ państw.'!M61","v":0},{"$f":"'61-samodz.publ.ZOZ państw.'!N61","v":0},{"$f":"'61-samodz.publ.ZOZ państw.'!O61","v":0},{"$f":"'61-samodz.publ.ZOZ państw.'!P61","v":0},{"$f":"'61-samodz.publ.ZOZ państw.'!M62","v":0},{"$f":"'61-samodz.publ.ZOZ państw.'!N62","v":0},{"$f":"'61-samodz.publ.ZOZ państw.'!O62","v":0},{"$f":"'61-samodz.publ.ZOZ państw.'!P62","v":0},{"$f":"'61-samodz.publ.ZOZ państw.'!M63","v":0},{"$f":"'61-samodz.publ.ZOZ państw.'!N63","v":0},{"$f":"'61-samodz.publ.ZOZ państw.'!O63","v":0},{"$f":"'61-samodz.publ.ZOZ państw.'!P63","v":0},{"$f":"'61-samodz.publ.ZOZ państw.'!M64","v":0},{"$f":"'61-samodz.publ.ZOZ państw.'!N64","v":0},{"$f":"'61-samodz.publ.ZOZ państw.'!O64","v":0},{"$f":"'61-samodz.publ.ZOZ państw.'!P64","v":0},{"$f":"'61-samodz.publ.ZOZ państw.'!M65","v":0},{"$f":"'61-samodz.publ.ZOZ państw.'!N65","v":0},{"$f":"'61-samodz.publ.ZOZ państw.'!O65","v":0},{"$f":"'61-samodz.publ.ZOZ państw.'!P65","v":0}]
[{"$f":"'62-samodz.publ.ZOZ samorz.'!A8","v":0},null,null,null,null,{"$f":"'62-samodz.publ.ZOZ samorz.'!L11","v":62},{"$f":"'62-samodz.publ.ZOZ samorz.'!K8","v":0},{"$f":"'62-samodz.publ.ZOZ samorz.'!H8","v":4},{"$f":"'62-samodz.publ.ZOZ samorz.'!M11","v":0},null,null,{"$f":"'62-samodz.publ.ZOZ samorz.'!M53","v":0},{"$f":"'62-samodz.publ.ZOZ samorz.'!N53","v":0},{"$f":"'62-samodz.publ.ZOZ samorz.'!O53","v":0},{"$f":"'62-samodz.publ.ZOZ samorz.'!P53","v":0},{"$f":"'62-samodz.publ.ZOZ samorz.'!M54","v":0},{"$f":"'62-samodz.publ.ZOZ samorz.'!N54","v":0},{"$f":"'62-samodz.publ.ZOZ samorz.'!O54","v":0},{"$f":"'62-samodz.publ.ZOZ samorz.'!P54","v":0},{"$f":"'62-samodz.publ.ZOZ samorz.'!M55","v":0},{"$f":"'62-samodz.publ.ZOZ samorz.'!N55","v":0},{"$f":"'62-samodz.publ.ZOZ samorz.'!O55","v":0},{"$f":"'62-samodz.publ.ZOZ samorz.'!P55","v":0},{"$f":"'62-samodz.publ.ZOZ samorz.'!M56","v":0},{"$f":"'62-samodz.publ.ZOZ samorz.'!N56","v":0},{"$f":"'62-samodz.publ.ZOZ samorz.'!O56","v":0},{"$f":"'62-samodz.publ.ZOZ samorz.'!P56","v":0},{"$f":"'62-samodz.publ.ZOZ samorz.'!M57","v":0},{"$f":"'62-samodz.publ.ZOZ samorz.'!N57","v":0},{"$f":"'62-samodz.publ.ZOZ samorz.'!O57","v":0},{"$f":"'62-samodz.publ.ZOZ samorz.'!P57","v":0},{"$f":"'62-samodz.publ.ZOZ samorz.'!M58","v":0},{"$f":"'62-samodz.publ.ZOZ samorz.'!N58","v":0},{"$f":"'62-samodz.publ.ZOZ samorz.'!O58","v":0},{"$f":"'62-samodz.publ.ZOZ samorz.'!P58","v":0},{"$f":"'62-samodz.publ.ZOZ samorz.'!M59","v":0},{"$f":"'62-samodz.publ.ZOZ samorz.'!N59","v":0},{"$f":"'62-samodz.publ.ZOZ samorz.'!O59","v":0},{"$f":"'62-samodz.publ.ZOZ samorz.'!P59","v":0},{"$f":"'62-samodz.publ.ZOZ samorz.'!M60","v":0},{"$f":"'62-samodz.publ.ZOZ samorz.'!N60","v":0},{"$f":"'62-samodz.publ.ZOZ samorz.'!O60","v":0},{"$f":"'62-samodz.publ.ZOZ samorz.'!P60","v":0},{"$f":"'62-samodz.publ.ZOZ samorz.'!M61","v":0},{"$f":"'62-samodz.publ.ZOZ samorz.'!N61","v":0},{"$f":"'62-samodz.publ.ZOZ samorz.'!O61","v":0},{"$f":"'62-samodz.publ.ZOZ samorz.'!P61","v":0},{"$f":"'62-samodz.publ.ZOZ samorz.'!M62","v":0},{"$f":"'62-samodz.publ.ZOZ samorz.'!N62","v":0},{"$f":"'62-samodz.publ.ZOZ samorz.'!O62","v":0},{"$f":"'62-samodz.publ.ZOZ samorz.'!P62","v":0},{"$f":"'62-samodz.publ.ZOZ samorz.'!M63","v":0},{"$f":"'62-samodz.publ.ZOZ samorz.'!N63","v":0},{"$f":"'62-samodz.publ.ZOZ samorz.'!O63","v":0},{"$f":"'62-samodz.publ.ZOZ samorz.'!P63","v":0},{"$f":"'62-samodz.publ.ZOZ samorz.'!M64","v":0},{"$f":"'62-samodz.publ.ZOZ samorz.'!N64","v":0},{"$f":"'62-samodz.publ.ZOZ samorz.'!O64","v":0},{"$f":"'62-samodz.publ.ZOZ samorz.'!P64","v":0},{"$f":"'62-samodz.publ.ZOZ samorz.'!M65","v":0},{"$f":"'62-samodz.publ.ZOZ samorz.'!N65","v":0},{"$f":"'62-samodz.publ.ZOZ samorz.'!O65","v":0},{"$f":"'62-samodz.publ.ZOZ samorz.'!P65","v":0}]
[{"$f":"'63-Narodowy Fundusz Zdrowia'!A8","v":0},null,null,null,null,{"$f":"'63-Narodowy Fundusz Zdrowia'!L11","v":63},{"$f":"'63-Narodowy Fundusz Zdrowia'!K8","v":0},{"$f":"'63-Narodowy Fundusz Zdrowia'!H8","v":4},{"$f":"'63-Narodowy Fundusz Zdrowia'!M11","v":0},null,null,{"$f":"'63-Narodowy Fundusz Zdrowia'!M53","v":0},{"$f":"'63-Narodowy Fundusz Zdrowia'!N53","v":0},{"$f":"'63-Narodowy Fundusz Zdrowia'!O53","v":0},{"$f":"'63-Narodowy Fundusz Zdrowia'!P53","v":0},{"$f":"'63-Narodowy Fundusz Zdrowia'!M54","v":0},{"$f":"'63-Narodowy Fundusz Zdrowia'!N54","v":0},{"$f":"'63-Narodowy Fundusz Zdrowia'!O54","v":0},{"$f":"'63-Narodowy Fundusz Zdrowia'!P54","v":0},{"$f":"'63-Narodowy Fundusz Zdrowia'!M55","v":0},{"$f":"'63-Narodowy Fundusz Zdrowia'!N55","v":0},{"$f":"'63-Narodowy Fundusz Zdrowia'!O55","v":0},{"$f":"'63-Narodowy Fundusz Zdrowia'!P55","v":0},{"$f":"'63-Narodowy Fundusz Zdrowia'!M56","v":0},{"$f":"'63-Narodowy Fundusz Zdrowia'!N56","v":0},{"$f":"'63-Narodowy Fundusz Zdrowia'!O56","v":0},{"$f":"'63-Narodowy Fundusz Zdrowia'!P56","v":0},{"$f":"'63-Narodowy Fundusz Zdrowia'!M57","v":0},{"$f":"'63-Narodowy Fundusz Zdrowia'!N57","v":0},{"$f":"'63-Narodowy Fundusz Zdrowia'!O57","v":0},{"$f":"'63-Narodowy Fundusz Zdrowia'!P57","v":0},{"$f":"'63-Narodowy Fundusz Zdrowia'!M58","v":0},{"$f":"'63-Narodowy Fundusz Zdrowia'!N58","v":0},{"$f":"'63-Narodowy Fundusz Zdrowia'!O58","v":0},{"$f":"'63-Narodowy Fundusz Zdrowia'!P58","v":0},{"$f":"'63-Narodowy Fundusz Zdrowia'!M59","v":0},{"$f":"'63-Narodowy Fundusz Zdrowia'!N59","v":0},{"$f":"'63-Narodowy Fundusz Zdrowia'!O59","v":0},{"$f":"'63-Narodowy Fundusz Zdrowia'!P59","v":0},{"$f":"'63-Narodowy Fundusz Zdrowia'!M60","v":0},{"$f":"'63-Narodowy Fundusz Zdrowia'!N60","v":0},{"$f":"'63-Narodowy Fundusz Zdrowia'!O60","v":0},{"$f":"'63-Narodowy Fundusz Zdrowia'!P60","v":0},{"$f":"'63-Narodowy Fundusz Zdrowia'!M61","v":0},{"$f":"'63-Narodowy Fundusz Zdrowia'!N61","v":0},{"$f":"'63-Narodowy Fundusz Zdrowia'!O61","v":0},{"$f":"'63-Narodowy Fundusz Zdrowia'!P61","v":0},{"$f":"'63-Narodowy Fundusz Zdrowia'!M62","v":0},{"$f":"'63-Narodowy Fundusz Zdrowia'!N62","v":0},{"$f":"'63-Narodowy Fundusz Zdrowia'!O62","v":0},{"$f":"'63-Narodowy Fundusz Zdrowia'!P62","v":0},{"$f":"'63-Narodowy Fundusz Zdrowia'!M63","v":0},{"$f":"'63-Narodowy Fundusz Zdrowia'!N63","v":0},{"$f":"'63-Narodowy Fundusz Zdrowia'!O63","v":0},{"$f":"'63-Narodowy Fundusz Zdrowia'!P63","v":0},{"$f":"'63-Narodowy Fundusz Zdrowia'!M64","v":0},{"$f":"'63-Narodowy Fundusz Zdrowia'!N64","v":0},{"$f":"'63-Narodowy Fundusz Zdrowia'!O64","v":0},{"$f":"'63-Narodowy Fundusz Zdrowia'!P64","v":0},{"$f":"'63-Narodowy Fundusz Zdrowia'!M65","v":0},{"$f":"'63-Narodowy Fundusz Zdrowia'!N65","v":0},{"$f":"'63-Narodowy Fundusz Zdrowia'!O65","v":0},{"$f":"'63-Narodowy Fundusz Zdrowia'!P65","v":0}]
[{"$f":"'71-ZUS'!A8","v":0},null,null,null,null,{"$f":"'71-ZUS'!L11","v":71},{"$f":"'71-ZUS'!K8","v":0},{"$f":"'71-ZUS'!H8","v":4},{"$f":"'71-ZUS'!M11","v":0},null,null,{"$f":"'71-ZUS'!M53","v":0},{"$f":"'71-ZUS'!N53","v":0},{"$f":"'71-ZUS'!O53","v":0},{"$f":"'71-ZUS'!P53","v":0},{"$f":"'71-ZUS'!M54","v":0},{"$f":"'71-ZUS'!N54","v":0},{"$f":"'71-ZUS'!O54","v":0},{"$f":"'71-ZUS'!P54","v":0},{"$f":"'71-ZUS'!M55","v":0},{"$f":"'71-ZUS'!N55","v":0},{"$f":"'71-ZUS'!O55","v":0},{"$f":"'71-ZUS'!P55","v":0},{"$f":"'71-ZUS'!M56","v":0},{"$f":"'71-ZUS'!N56","v":0},{"$f":"'71-ZUS'!O56","v":0},{"$f":"'71-ZUS'!P56","v":0},{"$f":"'71-ZUS'!M57","v":0},{"$f":"'71-ZUS'!N57","v":0},{"$f":"'71-ZUS'!O57","v":0},{"$f":"'71-ZUS'!P57","v":0},{"$f":"'71-ZUS'!M58","v":0},{"$f":"'71-ZUS'!N58","v":0},{"$f":"'71-ZUS'!O58","v":0},{"$f":"'71-ZUS'!P58","v":0},{"$f":"'71-ZUS'!M59","v":0},{"$f":"'71-ZUS'!N59","v":0},{"$f":"'71-ZUS'!O59","v":0},{"$f":"'71-ZUS'!P59","v":0},{"$f":"'71-ZUS'!M60","v":0},{"$f":"'71-ZUS'!N60","v":0},{"$f":"'71-ZUS'!O60","v":0},{"$f":"'71-ZUS'!P60","v":0},{"$f":"'71-ZUS'!M61","v":0},{"$f":"'71-ZUS'!N61","v":0},{"$f":"'71-ZUS'!O61","v":0},{"$f":"'71-ZUS'!P61","v":0},{"$f":"'71-ZUS'!M62","v":0},{"$f":"'71-ZUS'!N62","v":0},{"$f":"'71-ZUS'!O62","v":0},{"$f":"'71-ZUS'!P62","v":0},{"$f":"'71-ZUS'!M63","v":0},{"$f":"'71-ZUS'!N63","v":0},{"$f":"'71-ZUS'!O63","v":0},{"$f":"'71-ZUS'!P63","v":0},{"$f":"'71-ZUS'!M64","v":0},{"$f":"'71-ZUS'!N64","v":0},{"$f":"'71-ZUS'!O64","v":0},{"$f":"'71-ZUS'!P64","v":0},{"$f":"'71-ZUS'!M65","v":0},{"$f":"'71-ZUS'!N65","v":0},{"$f":"'71-ZUS'!O65","v":0},{"$f":"'71-ZUS'!P65","v":0}]
[{"$f":"'72-fund.zarz.przez ZUS'!A8:B8","v":0},null,null,null,null,{"$f":"'72-fund.zarz.przez ZUS'!L11","v":72},{"$f":"'72-fund.zarz.przez ZUS'!K8","v":0},{"$f":"'72-fund.zarz.przez ZUS'!H8","v":4},{"$f":"'72-fund.zarz.przez ZUS'!M11","v":0},null,null,{"$f":"'72-fund.zarz.przez ZUS'!M53","v":0},{"$f":"'72-fund.zarz.przez ZUS'!N53","v":0},{"$f":"'72-fund.zarz.przez ZUS'!O53","v":0},{"$f":"'72-fund.zarz.przez ZUS'!P53","v":0},{"$f":"'72-fund.zarz.przez ZUS'!M54","v":0},{"$f":"'72-fund.zarz.przez ZUS'!N54","v":0},{"$f":"'72-fund.zarz.przez ZUS'!O54","v":0},{"$f":"'72-fund.zarz.przez ZUS'!P54","v":0},{"$f":"'72-fund.zarz.przez ZUS'!M55","v":0},{"$f":"'72-fund.zarz.przez ZUS'!N55","v":0},{"$f":"'72-fund.zarz.przez ZUS'!O55","v":0},{"$f":"'72-fund.zarz.przez ZUS'!P55","v":0},{"$f":"'72-fund.zarz.przez ZUS'!M56","v":0},{"$f":"'72-fund.zarz.przez ZUS'!N56","v":0},{"$f":"'72-fund.zarz.przez ZUS'!O56","v":0},{"$f":"'72-fund.zarz.przez ZUS'!P56","v":0},{"$f":"'72-fund.zarz.przez ZUS'!M57","v":0},{"$f":"'72-fund.zarz.przez ZUS'!N57","v":0},{"$f":"'72-fund.zarz.przez ZUS'!O57","v":0},{"$f":"'72-fund.zarz.przez ZUS'!P57","v":0},{"$f":"'72-fund.zarz.przez ZUS'!M58","v":0},{"$f":"'72-fund.zarz.przez ZUS'!N58","v":0},{"$f":"'72-fund.zarz.przez ZUS'!O58","v":0},{"$f":"'72-fund.zarz.przez ZUS'!P58","v":0},{"$f":"'72-fund.zarz.przez ZUS'!M59","v":0},{"$f":"'72-fund.zarz.przez ZUS'!N59","v":0},{"$f":"'72-fund.zarz.przez ZUS'!O59","v":0},{"$f":"'72-fund.zarz.przez ZUS'!P59","v":0},{"$f":"'72-fund.zarz.przez ZUS'!M60","v":0},{"$f":"'72-fund.zarz.przez ZUS'!N60","v":0},{"$f":"'72-fund.zarz.przez ZUS'!O60","v":0},{"$f":"'72-fund.zarz.przez ZUS'!P60","v":0},{"$f":"'72-fund.zarz.przez ZUS'!M61","v":0},{"$f":"'72-fund.zarz.przez ZUS'!N61","v":0},{"$f":"'72-fund.zarz.przez ZUS'!O61","v":0},{"$f":"'72-fund.zarz.przez ZUS'!P61","v":0},{"$f":"'72-fund.zarz.przez ZUS'!M62","v":0},{"$f":"'72-fund.zarz.przez ZUS'!N62","v":0},{"$f":"'72-fund.zarz.przez ZUS'!O62","v":0},{"$f":"'72-fund.zarz.przez ZUS'!P62","v":0},{"$f":"'72-fund.zarz.przez ZUS'!M63","v":0},{"$f":"'72-fund.zarz.przez ZUS'!N63","v":0},{"$f":"'72-fund.zarz.przez ZUS'!O63","v":0},{"$f":"'72-fund.zarz.przez ZUS'!P63","v":0},{"$f":"'72-fund.zarz.przez ZUS'!M64","v":0},{"$f":"'72-fund.zarz.przez ZUS'!N64","v":0},{"$f":"'72-fund.zarz.przez ZUS'!O64","v":0},{"$f":"'72-fund.zarz.przez ZUS'!P64","v":0},{"$f":"'72-fund.zarz.przez ZUS'!M65","v":0},{"$f":"'72-fund.zarz.przez ZUS'!N65","v":0},{"$f":"'72-fund.zarz.przez ZUS'!O65","v":0},{"$f":"'72-fund.zarz.przez ZUS'!P65","v":0}]
[{"$f":"'73-KRUS'!A8:B8","v":0},null,null,null,null,{"$f":"'73-KRUS'!L11","v":73},{"$f":"'73-KRUS'!K8","v":0},{"$f":"'73-KRUS'!H8","v":4},{"$f":"'73-KRUS'!M11","v":0},null,null,{"$f":"'73-KRUS'!M53","v":0},{"$f":"'73-KRUS'!N53","v":0},{"$f":"'73-KRUS'!O53","v":0},{"$f":"'73-KRUS'!P53","v":0},{"$f":"'73-KRUS'!M54","v":0},{"$f":"'73-KRUS'!N54","v":0},{"$f":"'73-KRUS'!O54","v":0},{"$f":"'73-KRUS'!P54","v":0},{"$f":"'73-KRUS'!M55","v":0},{"$f":"'73-KRUS'!N55","v":0},{"$f":"'73-KRUS'!O55","v":0},{"$f":"'73-KRUS'!P55","v":0},{"$f":"'73-KRUS'!M56","v":0},{"$f":"'73-KRUS'!N56","v":0},{"$f":"'73-KRUS'!O56","v":0},{"$f":"'73-KRUS'!P56","v":0},{"$f":"'73-KRUS'!M57","v":0},{"$f":"'73-KRUS'!N57","v":0},{"$f":"'73-KRUS'!O57","v":0},{"$f":"'73-KRUS'!P57","v":0},{"$f":"'73-KRUS'!M58","v":0},{"$f":"'73-KRUS'!N58","v":0},{"$f":"'73-KRUS'!O58","v":0},{"$f":"'73-KRUS'!P58","v":0},{"$f":"'73-KRUS'!M59","v":0},{"$f":"'73-KRUS'!N59","v":0},{"$f":"'73-KRUS'!O59","v":0},{"$f":"'73-KRUS'!P59","v":0},{"$f":"'73-KRUS'!M60","v":0},{"$f":"'73-KRUS'!N60","v":0},{"$f":"'73-KRUS'!O60","v":0},{"$f":"'73-KRUS'!P60","v":0},{"$f":"'73-KRUS'!M61","v":0},{"$f":"'73-KRUS'!N61","v":0},{"$f":"'73-KRUS'!O61","v":0},{"$f":"'73-KRUS'!P61","v":0},{"$f":"'73-KRUS'!M62","v":0},{"$f":"'73-KRUS'!N62","v":0},{"$f":"'73-KRUS'!O62","v":0},{"$f":"'73-KRUS'!P62","v":0},{"$f":"'73-KRUS'!M63","v":0},{"$f":"'73-KRUS'!N63","v":0},{"$f":"'73-KRUS'!O63","v":0},{"$f":"'73-KRUS'!P63","v":0},{"$f":"'73-KRUS'!M64","v":0},{"$f":"'73-KRUS'!N64","v":0},{"$f":"'73-KRUS'!O64","v":0},{"$f":"'73-KRUS'!P64","v":0},{"$f":"'73-KRUS'!M65","v":0},{"$f":"'73-KRUS'!N65","v":0},{"$f":"'73-KRUS'!O65","v":0},{"$f":"'73-KRUS'!P65","v":0}]
[{"$f":"'81-państw.osoba prawna'!A8","v":0},null,null,null,null,{"$f":"'81-państw.osoba prawna'!L11","v":81},{"$f":"'81-państw.osoba prawna'!K8","v":0},{"$f":"'81-państw.osoba prawna'!H8","v":4},{"$f":"'81-państw.osoba prawna'!M11","v":0},null,null,{"$f":"'81-państw.osoba prawna'!M53","v":0},{"$f":"'81-państw.osoba prawna'!N53","v":0},{"$f":"'81-państw.osoba prawna'!O53","v":0},{"$f":"'81-państw.osoba prawna'!P53","v":0},{"$f":"'81-państw.osoba prawna'!M54","v":0},{"$f":"'81-państw.osoba prawna'!N54","v":0},{"$f":"'81-państw.osoba prawna'!O54","v":0},{"$f":"'81-państw.osoba prawna'!P54","v":0},{"$f":"'81-państw.osoba prawna'!M55","v":0},{"$f":"'81-państw.osoba prawna'!N55","v":0},{"$f":"'81-państw.osoba prawna'!O55","v":0},{"$f":"'81-państw.osoba prawna'!P55","v":0},{"$f":"'81-państw.osoba prawna'!M56","v":0},{"$f":"'81-państw.osoba prawna'!N56","v":0},{"$f":"'81-państw.osoba prawna'!O56","v":0},{"$f":"'81-państw.osoba prawna'!P56","v":0},{"$f":"'81-państw.osoba prawna'!M57","v":0},{"$f":"'81-państw.osoba prawna'!N57","v":0},{"$f":"'81-państw.osoba prawna'!O57","v":0},{"$f":"'81-państw.osoba prawna'!P57","v":0},{"$f":"'81-państw.osoba prawna'!M58","v":0},{"$f":"'81-państw.osoba prawna'!N58","v":0},{"$f":"'81-państw.osoba prawna'!O58","v":0},{"$f":"'81-państw.osoba prawna'!P58","v":0},{"$f":"'81-państw.osoba prawna'!M59","v":0},{"$f":"'81-państw.osoba prawna'!N59","v":0},{"$f":"'81-państw.osoba prawna'!O59","v":0},{"$f":"'81-państw.osoba prawna'!P59","v":0},{"$f":"'81-państw.osoba prawna'!M60","v":0},{"$f":"'81-państw.osoba prawna'!N60","v":0},{"$f":"'81-państw.osoba prawna'!O60","v":0},{"$f":"'81-państw.osoba prawna'!P60","v":0},{"$f":"'81-państw.osoba prawna'!M61","v":0},{"$f":"'81-państw.osoba prawna'!N61","v":0},{"$f":"'81-państw.osoba prawna'!O61","v":0},{"$f":"'81-państw.osoba prawna'!P61","v":0},{"$f":"'81-państw.osoba prawna'!M62","v":0},{"$f":"'81-państw.osoba prawna'!N62","v":0},{"$f":"'81-państw.osoba prawna'!O62","v":0},{"$f":"'81-państw.osoba prawna'!P62","v":0},{"$f":"'81-państw.osoba prawna'!M63","v":0},{"$f":"'81-państw.osoba prawna'!N63","v":0},{"$f":"'81-państw.osoba prawna'!O63","v":0},{"$f":"'81-państw.osoba prawna'!P63","v":0},{"$f":"'81-państw.osoba prawna'!M64","v":0},{"$f":"'81-państw.osoba prawna'!N64","v":0},{"$f":"'81-państw.osoba prawna'!O64","v":0},{"$f":"'81-państw.osoba prawna'!P64","v":0},{"$f":"'81-państw.osoba prawna'!M65","v":0},{"$f":"'81-państw.osoba prawna'!N65","v":0},{"$f":"'81-państw.osoba prawna'!O65","v":0},{"$f":"'81-państw.osoba prawna'!P65","v":0}]
[{"$f":"'82-samorz.osoba prawna'!A8","v":0},null,null,null,null,{"$f":"'82-samorz.osoba prawna'!L11","v":82},{"$f":"'82-samorz.osoba prawna'!K8","v":0},{"$f":"'82-samorz.osoba prawna'!H8","v":4},{"$f":"'82-samorz.osoba prawna'!M11","v":0},null,null,{"$f":"'82-samorz.osoba prawna'!M53","v":0},{"$f":"'82-samorz.osoba prawna'!N53","v":0},{"$f":"'82-samorz.osoba prawna'!O53","v":0},{"$f":"'82-samorz.osoba prawna'!P53","v":0},{"$f":"'82-samorz.osoba prawna'!M54","v":0},{"$f":"'82-samorz.osoba prawna'!N54","v":0},{"$f":"'82-samorz.osoba prawna'!O54","v":0},{"$f":"'82-samorz.osoba prawna'!P54","v":0},{"$f":"'82-samorz.osoba prawna'!M55","v":0},{"$f":"'82-samorz.osoba prawna'!N55","v":0},{"$f":"'82-samorz.osoba prawna'!O55","v":0},{"$f":"'82-samorz.osoba prawna'!P55","v":0},{"$f":"'82-samorz.osoba prawna'!M56","v":0},{"$f":"'82-samorz.osoba prawna'!N56","v":0},{"$f":"'82-samorz.osoba prawna'!O56","v":0},{"$f":"'82-samorz.osoba prawna'!P56","v":0},{"$f":"'82-samorz.osoba prawna'!M57","v":0},{"$f":"'82-samorz.osoba prawna'!N57","v":0},{"$f":"'82-samorz.osoba prawna'!O57","v":0},{"$f":"'82-samorz.osoba prawna'!P57","v":0},{"$f":"'82-samorz.osoba prawna'!M58","v":0},{"$f":"'82-samorz.osoba prawna'!N58","v":0},{"$f":"'82-samorz.osoba prawna'!O58","v":0},{"$f":"'82-samorz.osoba prawna'!P58","v":0},{"$f":"'82-samorz.osoba prawna'!M59","v":0},{"$f":"'82-samorz.osoba prawna'!N59","v":0},{"$f":"'82-samorz.osoba prawna'!O59","v":0},{"$f":"'82-samorz.osoba prawna'!P59","v":0},{"$f":"'82-samorz.osoba prawna'!M60","v":0},{"$f":"'82-samorz.osoba prawna'!N60","v":0},{"$f":"'82-samorz.osoba prawna'!O60","v":0},{"$f":"'82-samorz.osoba prawna'!P60","v":0},{"$f":"'82-samorz.osoba prawna'!M61","v":0},{"$f":"'82-samorz.osoba prawna'!N61","v":0},{"$f":"'82-samorz.osoba prawna'!O61","v":0},{"$f":"'82-samorz.osoba prawna'!P61","v":0},{"$f":"'82-samorz.osoba prawna'!M62","v":0},{"$f":"'82-samorz.osoba prawna'!N62","v":0},{"$f":"'82-samorz.osoba prawna'!O62","v":0},{"$f":"'82-samorz.osoba prawna'!P62","v":0},{"$f":"'82-samorz.osoba prawna'!M63","v":0},{"$f":"'82-samorz.osoba prawna'!N63","v":0},{"$f":"'82-samorz.osoba prawna'!O63","v":0},{"$f":"'82-samorz.osoba prawna'!P63","v":0},{"$f":"'82-samorz.osoba prawna'!M64","v":0},{"$f":"'82-samorz.osoba prawna'!N64","v":0},{"$f":"'82-samorz.osoba prawna'!O64","v":0},{"$f":"'82-samorz.osoba prawna'!P64","v":0},{"$f":"'82-samorz.osoba prawna'!M65","v":0},{"$f":"'82-samorz.osoba prawna'!N65","v":0},{"$f":"'82-samorz.osoba prawna'!O65","v":0},{"$f":"'82-samorz.osoba prawna'!P65","v":0}]
[{"$f":"'90-agencja wykonawcza'!A8","v":0},null,null,null,null,{"$f":"'90-agencja wykonawcza'!L11","v":90},{"$f":"'90-agencja wykonawcza'!K8","v":0},{"$f":"'90-agencja wykonawcza'!H8","v":4},{"$f":"'90-agencja wykonawcza'!M11","v":0},null,null,{"$f":"'90-agencja wykonawcza'!M53","v":0},{"$f":"'90-agencja wykonawcza'!N53","v":0},{"$f":"'90-agencja wykonawcza'!O53","v":0},{"$f":"'90-agencja wykonawcza'!P53","v":0},{"$f":"'90-agencja wykonawcza'!M54","v":0},{"$f":"'90-agencja wykonawcza'!N54","v":0},{"$f":"'90-agencja wykonawcza'!O54","v":0},{"$f":"'90-agencja wykonawcza'!P54","v":0},{"$f":"'90-agencja wykonawcza'!M55","v":0},{"$f":"'90-agencja wykonawcza'!N55","v":0},{"$f":"'90-agencja wykonawcza'!O55","v":0},{"$f":"'90-agencja wykonawcza'!P55","v":0},{"$f":"'90-agencja wykonawcza'!M56","v":0},{"$f":"'90-agencja wykonawcza'!N56","v":0},{"$f":"'90-agencja wykonawcza'!O56","v":0},{"$f":"'90-agencja wykonawcza'!P56","v":0},{"$f":"'90-agencja wykonawcza'!M57","v":0},{"$f":"'90-agencja wykonawcza'!N57","v":0},{"$f":"'90-agencja wykonawcza'!O57","v":0},{"$f":"'90-agencja wykonawcza'!P57","v":0},{"$f":"'90-agencja wykonawcza'!M58","v":0},{"$f":"'90-agencja wykonawcza'!N58","v":0},{"$f":"'90-agencja wykonawcza'!O58","v":0},{"$f":"'90-agencja wykonawcza'!P58","v":0},{"$f":"'90-agencja wykonawcza'!M59","v":0},{"$f":"'90-agencja wykonawcza'!N59","v":0},{"$f":"'90-agencja wykonawcza'!O59","v":0},{"$f":"'90-agencja wykonawcza'!P59","v":0},{"$f":"'90-agencja wykonawcza'!M60","v":0},{"$f":"'90-agencja wykonawcza'!N60","v":0},{"$f":"'90-agencja wykonawcza'!O60","v":0},{"$f":"'90-agencja wykonawcza'!P60","v":0},{"$f":"'90-agencja wykonawcza'!M61","v":0},{"$f":"'90-agencja wykonawcza'!N61","v":0},{"$f":"'90-agencja wykonawcza'!O61","v":0},{"$f":"'90-agencja wykonawcza'!P61","v":0},{"$f":"'90-agencja wykonawcza'!M62","v":0},{"$f":"'90-agencja wykonawcza'!N62","v":0},{"$f":"'90-agencja wykonawcza'!O62","v":0},{"$f":"'90-agencja wykonawcza'!P62","v":0},{"$f":"'90-agencja wykonawcza'!M63","v":0},{"$f":"'90-agencja wykonawcza'!N63","v":0},{"$f":"'90-agencja wykonawcza'!O63","v":0},{"$f":"'90-agencja wykonawcza'!P63","v":0},{"$f":"'90-agencja wykonawcza'!M64","v":0},{"$f":"'90-agencja wykonawcza'!N64","v":0},{"$f":"'90-agencja wykonawcza'!O64","v":0},{"$f":"'90-agencja wykonawcza'!P64","v":0},{"$f":"'90-agencja wykonawcza'!M65","v":0},{"$f":"'90-agencja wykonawcza'!N65","v":0},{"$f":"'90-agencja wykonawcza'!O65","v":0},{"$f":"'90-agencja wykonawcza'!P65","v":0}]
[{"$f":"'99-zbiorczo'!A8","v":"Brak nr REGON"},null,null,null,null,{"$f":"'99-zbiorczo'!L11","v":99},{"$f":"'99-zbiorczo'!K8","v":"Brak roku"},{"$f":"'99-zbiorczo'!H8","v":4},{"$f":"'99-zbiorczo'!M11","v":0},null,null,{"$f":"'99-zbiorczo'!M53","v":0},{"$f":"'99-zbiorczo'!N53","v":0},{"$f":"'99-zbiorczo'!O53","v":0},{"$f":"'99-zbiorczo'!P53","v":0},{"$f":"'99-zbiorczo'!M54","v":0},{"$f":"'99-zbiorczo'!N54","v":0},{"$f":"'99-zbiorczo'!O54","v":0},{"$f":"'99-zbiorczo'!P54","v":0},{"$f":"'99-zbiorczo'!M55","v":0},{"$f":"'99-zbiorczo'!N55","v":0},{"$f":"'99-zbiorczo'!O55","v":0},{"$f":"'99-zbiorczo'!P55","v":0},{"$f":"'99-zbiorczo'!M56","v":0},{"$f":"'99-zbiorczo'!N56","v":0},{"$f":"'99-zbiorczo'!O56","v":0},{"$f":"'99-zbiorczo'!P56","v":0},{"$f":"'99-zbiorczo'!M57","v":0},{"$f":"'99-zbiorczo'!N57","v":0},{"$f":"'99-zbiorczo'!O57","v":0},{"$f":"'99-zbiorczo'!P57","v":0},{"$f":"'99-zbiorczo'!M58","v":0},{"$f":"'99-zbiorczo'!N58","v":0},{"$f":"'99-zbiorczo'!O58","v":0},{"$f":"'99-zbiorczo'!P58","v":0},{"$f":"'99-zbiorczo'!M59","v":0},{"$f":"'99-zbiorczo'!N59","v":0},{"$f":"'99-zbiorczo'!O59","v":0},{"$f":"'99-zbiorczo'!P59","v":0},{"$f":"'99-zbiorczo'!M60","v":0},{"$f":"'99-zbiorczo'!N60","v":0},{"$f":"'99-zbiorczo'!O60","v":0},{"$f":"'99-zbiorczo'!P60","v":0},{"$f":"'99-zbiorczo'!M61","v":0},{"$f":"'99-zbiorczo'!N61","v":0},{"$f":"'99-zbiorczo'!O61","v":0},{"$f":"'99-zbiorczo'!P61","v":0},{"$f":"'99-zbiorczo'!M62","v":0},{"$f":"'99-zbiorczo'!N62","v":0},{"$f":"'99-zbiorczo'!O62","v":0},{"$f":"'99-zbiorczo'!P62","v":0},{"$f":"'99-zbiorczo'!M63","v":0},{"$f":"'99-zbiorczo'!N63","v":0},{"$f":"'99-zbiorczo'!O63","v":0},{"$f":"'99-zbiorczo'!P63","v":0},{"$f":"'99-zbiorczo'!M64","v":0},{"$f":"'99-zbiorczo'!N64","v":0},{"$f":"'99-zbiorczo'!O64","v":0},{"$f":"'99-zbiorczo'!P64","v":0},{"$f":"'99-zbiorczo'!M65","v":0},{"$f":"'99-zbiorczo'!N65","v":0},{"$f":"'99-zbiorczo'!O65","v":0},{"$f":"'99-zbiorczo'!P65","v":0}]